program: Orca
programVersion: 4.2.1
elementType: Cl S O O O O O O O N N N N N N C C C C C C C C C C C C C H H H H H H H H H H H H H H H
charge: 0
multiplicity: 1
keywords: wb97x-d3
keywords: def2-TZVPP
keywords: def2/J RIJCOSX GRIDX6 NOFINALGRIDX
keywords: grid4 nofinalgrid
keywords: scfconv7
keywords: smallprint printgap noloewdin
keywords: NOSOSCF
formula: C13H15ClN6O7S
InChI: InChI=1S/C13H15ClN6O7S/c1-20-10(8(9(14)18-20)11(21)27-4)28(23,24)19-13(22)17-12-15-6(25-2)5-7(16-12)26-3/h5,17,19H,1-4H3
43 atoms
Cl 4.315163 2.308553 0.568638
S  1.018767 -1.631387 -1.555549
O  1.455702 -3.006279 -1.620807
O  0.643352 -0.947286 -2.771189
O  1.729632 2.89544 -0.804506
O  0.128614 1.354652 -1.039746
O  0.794545 -2.33932 1.2622
O  -4.99117 0.76703 2.980121
O  -3.936072 0.684855 -1.538233
N  3.443721 -1.207938 -0.305648
N  -0.284329 -1.505216 -0.551138
N  4.24103 -0.265901 0.173539
N  -1.238264 -1.403383 1.563896
N  -3.11329 -0.331334 2.275819
N  -2.582917 -0.366602 -0.023117
C  2.28507 -0.692532 -0.747728
C  2.334432 0.682523 -0.549582
C  3.595201 0.86693 0.032603
C  3.919507 -2.582837 -0.263112
C  1.276818 1.660041 -0.827291
C  -0.17899 -1.790132 0.787379
C  -2.361246 -0.66452 1.244359
C  -4.193042 0.386635 1.997317
C  -3.668436 0.354811 -0.286813
C  0.77988 3.944481 -1.014035
C  -4.536256 0.772048 0.706955
C  -4.663092 0.407221 4.320678
C  -3.042791 0.269952 -2.570941
H  -1.081619 -0.919078 -0.845305
H  3.207699 -3.218327 0.25098
H  4.10737 -2.959275 -1.263805
H  4.850628 -2.570532 0.291252
H  -1.128268 -1.613877 2.547373
H  0.009943 3.940235 -0.243406
H  1.343909 4.869977 -0.95448
H  0.314879 3.86705 -1.996019
H  -5.41752 1.359034 0.494425
H  -5.439768 0.848389 4.93896
H  -3.695916 0.808785 4.620694
H  -4.665234 -0.673321 4.459567
H  -2.950401 -0.815343 -2.614358
H  -2.059259 0.724234 -2.453435
H  -3.484181 0.62248 -3.498737
elementType: Cl S O N C H
totalener: -2218.08276926 hartree
nucrepener: 3269.14427035 hartree
electener: -5487.22703961 hartree
oneelecener: -9549.48806694 hartree
twoeener: 4062.26102733 hartree
cpcmener: -0.03986893 hartree
kineticenergy: 2211.23078622 hartree
xcener: -164.126979965319 hartree
chargesum: 0.0000000
charge: -0.022371 0.888874 -0.492523 -0.490565 -0.269401 -0.464375 -0.478451 -0.300354 -0.297412 0.189938 -0.195448 -0.284639 -0.130313 -0.423325 -0.417077 -0.077761 -0.104675 0.079222 -0.149460 0.502289 0.377096 0.365029 0.420978 0.422889 -0.126970 -0.326381 -0.115074 -0.126615 0.224970 0.127200 0.137611 0.118065 0.194015 0.121415 0.128221 0.119293 0.146764 0.133082 0.113959 0.115121 0.117286 0.109137 0.140735
qa: -0.0224 0.8889 -0.4925 -0.4906 -0.2694 -0.4644 -0.4785 -0.3004 -0.2974 0.1899 -0.1954 -0.2846 -0.1303 -0.4233 -0.4171 -0.0778 -0.1047 0.0792 -0.1495 0.5023 0.3771 0.3650 0.4210 0.4229 -0.1270 -0.3264 -0.1151 -0.1266 0.2250 0.1272 0.1376 0.1181 0.1940 0.1214 0.1282 0.1193 0.1468 0.1331 0.1140 0.1151 0.1173 0.1091 0.1407
va: 1.2921 5.8741 2.0061 2.0054 2.1556 2.0221 2.0309 2.1212 2.1303 3.3912 3.0956 2.8690 3.1923 2.9713 2.9708 4.0432 3.7248 4.2887 3.8415 4.0932 4.3903 4.2511 4.0166 3.9840 3.8662 3.9391 3.8453 3.8390 1.0551 1.0024 0.9904 1.0080 1.0156 0.9929 0.9961 0.9923 1.0160 0.9933 0.9957 0.9949 0.9910 1.0001 0.9953
dispcorr: -0.025207624 hartree
energy: -2218.107976881249
dipole: -21.19884 19.43731 -1.76153 1.01734 0.50441 1.52176 2.88495 -1.54376 1.34119
magnitude: 2.68655 au
magnitude: 6.82866 debye
