program: Orca
programVersion: 4.2.1
elementType: Cl S O O O O O O O N N N N N N C C C C C C C C C C C C C H H H H H H H H H H H H H H H
charge: 0
multiplicity: 1
keywords: wb97x-d3
keywords: def2-TZVPP
keywords: def2/J RIJCOSX GRIDX6 NOFINALGRIDX
keywords: grid4 nofinalgrid
keywords: scfconv7
keywords: smallprint printgap noloewdin
keywords: NOSOSCF
formula: C13H15ClN6O7S
InChI: InChI=1S/C13H15ClN6O7S/c1-20-10(8(9(14)18-20)11(21)27-4)28(23,24)19-13(22)17-12-15-6(25-2)5-7(16-12)26-3/h5,17,19H,1-4H3
43 atoms
Cl 4.187034 2.333044 0.700267
S  1.035227 -1.655087 -1.561346
O  1.500772 -3.019573 -1.61494
O  0.662531 -0.968166 -2.775038
O  1.668719 2.883054 -0.829018
O  0.077847 1.330927 -1.037872
O  0.739583 -2.470575 1.235644
O  -4.92625 0.801373 2.982102
O  -3.878802 0.766696 -1.537971
N  3.421974 -1.18942 -0.250765
N  -0.282094 -1.549241 -0.571749
N  4.181624 -0.237427 0.267027
N  -1.282886 -1.507643 1.521598
N  -3.112189 -0.372353 2.247883
N  -2.574549 -0.377156 -0.048345
C  2.269744 -0.692932 -0.72944
C  2.285314 0.681058 -0.518158
C  3.519912 0.883925 0.11344
C  3.935567 -2.550525 -0.222078
C  1.222669 1.644771 -0.827184
C  -0.210514 -1.889208 0.757114
C  -2.371849 -0.716886 1.212193
C  -4.153695 0.405247 1.987732
C  -3.625262 0.399096 -0.297014
C  0.711135 3.920934 -1.049093
C  -4.474604 0.836563 0.705997
C  -4.596216 0.40481 4.310482
C  -3.016328 0.330996 -2.586963
H  -1.066723 -0.947731 -0.865119
H  4.093948 -2.926406 -1.228214
H  4.887824 -2.507317 0.29479
H  3.260127 -3.203787 0.320772
H  -1.201227 -1.753297 2.500035
H  -0.050603 3.929268 -0.269158
H  1.269965 4.851693 -1.015562
H  0.232514 3.821802 -2.023292
H  -5.325361 1.471114 0.505239
H  -3.611515 0.767115 4.606431
H  -4.631391 -0.678029 4.43036
H  -5.350399 0.860032 4.947131
H  -2.970979 -0.756753 -2.650111
H  -2.012496 0.739668 -2.47577
H  -3.454061 0.717613 -3.503678
elementType: Cl S O N C H
totalener: -2218.08483897 hartree
nucrepener: 3273.65574962 hartree
electener: -5491.74058859 hartree
oneelecener: -9558.37714337 hartree
twoeener: 4066.63655478 hartree
cpcmener: -0.03298422 hartree
kineticenergy: 2211.23988881 hartree
xcener: -164.125879521299 hartree
chargesum: 0.0000000
charge: -0.024292 0.878432 -0.477342 -0.480249 -0.268498 -0.449561 -0.456404 -0.292140 -0.288713 0.189865 -0.198566 -0.282828 -0.137245 -0.423181 -0.415478 -0.078771 -0.110508 0.080234 -0.150581 0.491608 0.364576 0.362471 0.415025 0.419112 -0.125598 -0.326267 -0.116053 -0.129460 0.224710 0.133330 0.117734 0.130156 0.190959 0.119548 0.127947 0.116973 0.144156 0.113000 0.113464 0.131754 0.116645 0.111603 0.138432
qa: -0.0243 0.8784 -0.4773 -0.4802 -0.2685 -0.4496 -0.4564 -0.2921 -0.2887 0.1899 -0.1986 -0.2828 -0.1372 -0.4232 -0.4155 -0.0788 -0.1105 0.0802 -0.1506 0.4916 0.3646 0.3625 0.4150 0.4191 -0.1256 -0.3263 -0.1161 -0.1295 0.2247 0.1333 0.1177 0.1302 0.1910 0.1195 0.1279 0.1170 0.1442 0.1130 0.1135 0.1318 0.1166 0.1116 0.1384
va: 1.2892 5.8925 2.0241 2.0184 2.1532 2.0392 2.0567 2.1303 2.1396 3.3878 3.0874 2.8662 3.1846 2.9682 2.9688 4.0417 3.7255 4.2815 3.8439 4.1000 4.4042 4.2542 4.0250 3.9929 3.8700 3.9373 3.8495 3.8400 1.0545 0.9927 1.0084 1.0002 1.0178 0.9934 0.9960 0.9930 1.0168 0.9960 0.9953 0.9934 0.9914 1.0004 0.9952
dispcorr: -0.025312809 hartree
energy: -2218.110151782580
dipole: -20.71021 19.03939 -1.67082 1.17212 0.29483 1.46696 2.42866 -1.23425 1.19441
magnitude: 2.52393 au
magnitude: 6.41532 debye
