program: Gaussian 09
title: 000069124
version: EM64L-G09RevD.01
frameworkgroup: C1[X(C8H7N3O5)]
method: RPBEPBE
basis: SDD
operation: Freq
keyword: #pfreq=noraman
keyword: PBEPBE/SDD
title: #p freq=noraman PBEPBE/SDD
converged: NO YES NO NO
title: Mulliken charges:
elementType: O O O O O N N N C C C C C C C C H H H H H H H
charge: -0.231478 -0.169617 -0.247153 -0.197034 -0.195068 -0.433165 0.030683 0.018687 0.361103 0.225210 -0.273538 -0.498256 0.454202 -0.395719 0.228779 -0.781639 0.331029 0.338542 0.297642 0.365161 0.250892 0.271020 0.249716
chargesum: 0.00000
title: Mulliken charges with hydrogens summed into heavy atoms:
elementType: O O O O O N N N C C C C C C C C
charge: -0.231478 -0.169617 -0.247153 -0.197034 -0.195068 -0.068004 0.030683 0.018687 0.361103 0.225210 0.057490 -0.159714 0.454202 -0.098077 0.228779 -0.010011
polarizability: 2.24830573e+02 1.32536481e+00 1.63443826e+02 -1.24175391e-02 2.55057148e-02 5.28773676e+01
1716.lowfreq: -28.4927 -7.2108 -0.0006 -0.0006 -0.0005 4.7525 6.5990 50.6171 52.2172
frequency: -28.3460 50.6153 52.2131 62.9750 91.5139 126.0066 157.6055 164.6271 171.1312 260.0770 290.1044 324.5075 325.8976 370.7582 424.1366 436.4555 494.5924 519.7493 529.8510 586.0837 606.1643 656.9723 663.6502 680.5356 711.3143 738.8467 756.9010 809.6330 871.7553 882.3199 908.8662 932.2174 964.6304 986.6770 1021.9852 1038.0412 1054.2708 1103.6122 1141.7680 1163.4064 1202.5010 1227.3887 1239.2665 1299.9182 1340.0932 1356.4146 1382.5865 1384.4539 1432.7664 1448.1027 1463.0679 1484.1897 1526.2727 1583.4277 1617.8302 1646.2075 2994.3723 3078.7047 3142.8605 3179.6930 3190.6738 3196.7493 3262.6527
redmass: 1.0633 8.8447 10.1492 5.8430 6.3977 6.3866 5.4215 6.4651 8.8547 8.9803 6.0461 6.3701 9.9666 11.4861 5.0032 3.9668 9.5947 3.7666 5.3876 3.0004 6.2532 8.1543 6.6269 8.8729 7.2533 5.1313 12.6681 5.2863 7.1387 1.4328 1.1094 5.8750 1.4158 1.7711 1.3209 1.6858 2.1262 3.7735 1.4425 7.1505 5.3348 4.1354 1.7714 2.1144 5.8380 5.6268 3.5693 1.5941 5.0801 1.1585 1.0456 3.4368 2.3669 5.2827 6.2639 4.5997 1.0385 1.0977 1.0988 1.0905 1.0920 1.0967 1.0798
irintensity: 1.3583 1.2679 1.5426 0.2083 10.0365 2.8302 0.3745 1.7241 9.1378 0.2003 0.1330 0.2645 0.2477 0.9181 3.4515 0.8227 9.8479 9.7205 7.8057 0.0052 0.8673 18.2059 13.9201 27.9225 6.7024 1.0185 15.4311 2.7412 7.9932 51.5959 72.0621 2.5481 26.1376 57.1506 1.3504 13.8126 29.1795 36.8828 55.8707 229.5436 656.1271 11.0160 40.0205 18.2134 497.1457 49.4029 90.2705 106.4192 30.9271 14.5202 21.0654 149.1260 240.9147 256.2241 145.5644 97.2723 1.7959 7.6404 7.3561 7.8046 23.9166 6.5573 135.8070
temp: 298.150 k
press: 1.00000 atm
elementType: 8 8 8 8 8 7 7 7 6 6 6 6 6 6 6 6 1 1 1 1 1 1 1
symmnumber: 1
zpe: 405609.8 jmol-1
zpe.correction: 0.154489 hartree
zpe.thermalcorrener: 0.167978 hartree
zpe.thermalcorrenthalpy: 0.168922 hartree
zpe.thermalcorrgfe: 0.112928 hartree
zpe.sumelectzpe: -848.123970 hartree
zpe.sumelectthermal: -848.110480 hartree
zpe.sumelectthermalent: -848.109536 hartree
zpe.sumelectthermalfe: -848.165531 hartree
dipole: -5.1521 -0.7153 0.0054
dipole: 5.2016
quadrupole: -101.5614 -109.2613 -89.4910
quadrupole: -1.7329 -0.0450 0.0009
quadrupole: -1.4568 -9.1567 10.6136 -1.7329 -0.0450 0.0009
hfenergy: -848.2784584 hartree
pointgroup: C01 [X(C8H7N3O5)]
dipole: -2.0252046 -0.2941412 0.0011928 debye
dipolederiv: -0.6489722 0.071855 0.0004271 -0.5477632 -0.9910845 -0.0016586 0.0017579 0.0006673 -0.3182222 -0.4896083 -0.2789667 -0.000276 -0.1748368 -0.9036281 -0.0001387 -0.0002264 -0.0000529 -0.1998177 -0.8148275 0.2173896 -0.0004936 0.0949106 -0.5310073 0.0000675 -0.0006696 0.000305 -0.2511339 -0.7370144 0.2315882 -0.0003663 0.293148 -0.6780304 0.0000445 -0.0005761 0.0003225 -0.2218815 -0.8463288 -0.1412535 -0.0004636 -0.2775203 -0.5627199 -0.0001296 -0.0008195 -0.0002997 -0.2193101 -2.3292998 -0.6987362 -0.0001937 -0.6553691 -0.7407391 0.0005374 -0.0010262 -0.000567 -0.2816399 1.0431617 -0.2198333 0.0008952 -0.1039265 1.8441177 -0.0002182 0.0009048 -0.0003318 0.2001308 2.0867898 -0.185655 0.0015075 -0.1010121 1.011534 0.0000173 0.0018714 -0.0000619 0.1841183 1.5790937 0.4421525 0.0007883 -0.4187033 0.2000141 -0.0001716 0.0013794 0.0003938 0.1426455 -0.5064769 0.3498355 -0.0003943 -0.1455216 -0.789929 0.00008 -0.0007857 0.0000949 0.0095666 -0.7047572 0.0059453 -0.0001345 0.522736 0.020181 0.0002663 0.0000022 0.000089 -0.135404 0.2973294 -0.452806 0.0003156 -0.2341276 0.1574149 -0.0002115 0.0003441 -0.0004044 -0.0483401 -0.8831753 0.1136156 -0.0006976 0.0460664 -0.435572 0.0001392 -0.000812 0.0000671 0.0527918 0.5235785 0.1365184 0.0002921 0.2408829 0.208221 0.0002021 0.0006207 0.0001358 -0.0761283 2.0481492 0.3666531 -0.0021067 1.1782865 1.4395442 0.0021054 -0.0063418 0.0004736 0.1936341 -0.4942516 0.0758456 0.0018381 0.2421693 -0.0698637 -0.0022532 0.0108653 -0.0023728 0.0306238 0.1638023 -0.0349692 -0.0001343 0.0222967 0.1025195 0.0000184 -0.0001965 -0.0000597 0.1759077 0.1689299 -0.0012768 -0.0000116 -0.0153688 0.1450568 -0.0000218 0.000048 -0.0000299 0.1805968 0.1252145 0.0488852 -0.0000211 0.0087007 0.0806974 -0.0000118 -0.0000592 0.0000021 0.1646215 0.2422606 0.0130479 -0.0001653 0.124237 0.3768608 0.0000383 -0.0006451 0.0000501 0.2982829 0.0786374 -0.0044385 -0.0223609 0.0084947 0.0595956 -0.0964156 0.0112327 -0.0918413 -0.0114624 0.0180896 -0.0492505 -0.0015438 -0.1165433 0.0052556 -0.0027565 -0.0041809 -0.0019759 0.1355539 0.0796753 -0.0061463 0.0232996 0.0087639 0.0515615 0.1004709 -0.0126876 0.095396 -0.0051336 unknown
polarizability: 224.8114749|1.7107901|163.4629006|0.0711702|0.0102735|52.8773911 unknown
charge 0 multiplicity 1
23 atoms
O  -2.945573 -2.352064 -0.002445
O  0.308917 3.290997 -0.00073
O  -1.81295 2.486065 -0.002888
O  3.972396 -1.773897 0.002516
O  4.169872 0.502258 0.002908
N  -2.226199 -0.104414 -0.003023
N  -0.514787 2.306849 -0.00129
N  3.472027 -0.583256 0.00172
C  -0.837594 -0.23833 -0.001834
C  0.015915 0.92876 -0.000964
C  -0.195644 -1.518171 -0.001552
C  1.421954 0.815182 0.000191
C  1.996407 -0.460799 0.000496
C  1.197305 -1.630874 -0.000367
C  -3.212853 -1.120506 -0.003865
C  -4.630416 -0.56834 0.001077
H  -0.830625 -2.405323 -0.002411
H  2.046302 1.711955 0.000821
H  1.684482 -2.609542 -0.000122
H  -2.538927 0.885293 -0.002713
H  -4.814952 0.040701 0.905068
H  -5.339857 -1.40729 -0.016098
H  -4.810301 0.075147 -0.879498
