program: Orca
programVersion: 4.2.1
elementType: Cl S O O O O O O O N N N N N N C C C C C C C C C C C C C H H H H H H H H H H H H H H H
charge: 0
multiplicity: 1
keywords: wb97x-d3
keywords: def2-TZVPP
keywords: def2/J RIJCOSX GRIDX6 NOFINALGRIDX
keywords: grid4 nofinalgrid
keywords: scfconv7
keywords: smallprint printgap noloewdin
keywords: NOSOSCF
formula: C13H15ClN6O7S
InChI: InChI=1S/C13H15ClN6O7S/c1-20-10(8(9(14)18-20)11(21)27-4)28(23,24)19-13(22)17-12-15-6(25-2)5-7(16-12)26-3/h5,17,19H,1-4H3
43 atoms
Cl 4.236192 -2.24518 2.059072
S  1.470702 1.339964 -1.129818
O  1.893028 1.608196 -2.483712
O  1.437035 2.405222 -0.15283
O  0.558563 0.268817 1.762717
O  2.31199 0.019606 3.128727
O  0.43631 -1.139537 -2.334302
O  -3.431058 2.605473 0.884365
O  -5.976246 -1.152666 -0.090932
N  3.419006 -0.614785 -1.196763
N  -0.053087 0.712407 -1.120024
N  4.105338 -1.446183 -0.430966
N  -1.65901 -0.90675 -1.517968
N  -2.51922 0.86961 -0.287535
N  -3.813476 -1.031394 -0.804566
C  2.483866 0.044296 -0.48896
C  2.57982 -0.377761 0.828466
C  3.621935 -1.30932 0.78035
C  3.773205 -0.541855 -2.605808
C  1.821318 0.000666 2.030346
C  -0.368389 -0.483022 -1.709283
C  -2.704003 -0.320651 -0.834686
C  -3.56078 1.41023 0.339584
C  -4.839084 -0.489164 -0.162987
C  -0.273839 0.654515 2.858368
C  -4.779017 0.761997 0.441892
C  -2.22206 3.333898 0.688372
C  -6.064259 -2.438022 -0.70175
H  -0.785762 1.182879 -0.565921
H  4.508178 -1.320607 -2.778447
H  2.904412 -0.723191 -3.229715
H  4.212962 0.421784 -2.845578
H  -1.868797 -1.805232 -1.933755
H  -0.272405 -0.099503 3.644871
H  0.036445 1.61318 3.274055
H  -1.279156 0.736255 2.455581
H  -5.624834 1.200227 0.951159
H  -2.008368 3.486316 -0.370114
H  -1.369244 2.853556 1.170533
H  -2.381753 4.300683 1.15812
H  -7.075927 -2.784639 -0.508312
H  -5.354347 -3.140968 -0.265941
H  -5.902708 -2.384877 -1.77842
elementType: Cl S O N C H
totalener: -2218.08392832 hartree
nucrepener: 3266.56090857 hartree
electener: -5484.64483690 hartree
oneelecener: -9542.77766243 hartree
twoeener: 4058.13282553 hartree
cpcmener: -0.03692191 hartree
kineticenergy: 2211.24346885 hartree
xcener: -164.127085715870 hartree
chargesum: -0.0000000
charge: -0.023397 0.870936 -0.478379 -0.483955 -0.268140 -0.418847 -0.460551 -0.287449 -0.289389 0.189262 -0.182567 -0.282629 -0.132804 -0.428929 -0.423370 -0.075127 -0.075034 0.076196 -0.153079 0.417506 0.379911 0.375612 0.406832 0.412113 -0.129104 -0.313335 -0.112864 -0.116323 0.199074 0.118678 0.131047 0.131880 0.191687 0.133782 0.134856 0.105459 0.145607 0.123239 0.089388 0.141709 0.132201 0.114189 0.114110
qa: -0.0234 0.8709 -0.4784 -0.4840 -0.2681 -0.4188 -0.4606 -0.2874 -0.2894 0.1893 -0.1826 -0.2826 -0.1328 -0.4289 -0.4234 -0.0751 -0.0750 0.0762 -0.1531 0.4175 0.3799 0.3756 0.4068 0.4121 -0.1291 -0.3133 -0.1129 -0.1163 0.1991 0.1187 0.1310 0.1319 0.1917 0.1338 0.1349 0.1055 0.1456 0.1232 0.0894 0.1417 0.1322 0.1142 0.1141
va: 1.2934 5.8869 2.0249 2.0103 2.1228 2.0873 2.0572 2.1337 2.1361 3.3802 3.0844 2.8717 3.1901 2.9447 2.9715 4.0450 3.7200 4.3006 3.8453 4.1937 4.3874 4.2367 3.9841 4.0325 3.8468 3.9415 3.8523 3.8481 1.0808 1.0078 1.0009 0.9924 1.0172 0.9987 0.9876 0.9999 1.0160 0.9905 0.9833 0.9968 0.9934 0.9954 0.9954
dispcorr: -0.026440005 hartree
energy: -2218.110368329316
dipole: -26.56259 22.82375 -3.73883 6.05584 -6.29379 -0.23794 -3.94982 3.51969 -0.43013
magnitude: 3.77101 au
magnitude: 9.58514 debye
