program: Orca
programVersion: 4.2.1
elementType: Cl S O O O O O O O N N N N N N C C C C C C C C C C C C C H H H H H H H H H H H H H H H
charge: 0
multiplicity: 1
keywords: wb97x-d3
keywords: def2-TZVPP
keywords: def2/J RIJCOSX GRIDX6 NOFINALGRIDX
keywords: grid4 nofinalgrid
keywords: scfconv7
keywords: smallprint printgap noloewdin
keywords: NOSOSCF
formula: C13H15ClN6O7S
InChI: InChI=1S/C13H15ClN6O7S/c1-20-10(8(9(14)18-20)11(21)27-4)28(23,24)19-13(22)17-12-15-6(25-2)5-7(16-12)26-3/h5,17,19H,1-4H3
43 atoms
Cl 4.29155 2.337665 0.633067
S  1.026985 -1.607231 -1.525581
O  1.466494 -2.980699 -1.586333
O  0.659428 -0.911902 -2.736971
O  1.798359 2.905775 -0.972801
O  0.1384 1.411103 -0.984104
O  0.732796 -2.413976 1.274228
O  -5.097055 0.603272 2.967097
O  -3.89264 0.801028 -1.50957
N  3.426111 -1.187971 -0.221501
N  -0.280275 -1.478416 -0.529734
N  4.215769 -0.245429 0.268251
N  -1.304219 -1.4798 1.551397
N  -3.202911 -0.450804 2.255282
N  -2.59014 -0.34375 -0.019562
C  2.286292 -0.669948 -0.70721
C  2.343085 0.707072 -0.532456
C  3.586194 0.890335 0.086456
C  3.898307 -2.563106 -0.160374
C  1.303949 1.6919 -0.857234
C  -0.2184 -1.836046 0.794323
C  -2.414221 -0.72293 1.234074
C  -4.270026 0.288629 1.987941
C  -3.665284 0.396603 -0.275227
C  0.873095 3.966261 -1.225316
C  -4.565606 0.757731 0.713433
C  -4.811049 0.141984 4.284954
C  -2.975335 0.444364 -2.542092
H  -1.067665 -0.88007 -0.823655
H  4.842936 -2.53942 0.371592
H  3.194692 -3.185349 0.382464
H  4.060152 -2.961839 -1.15718
H  -1.23275 -1.742977 2.525873
H  0.140662 4.054125 -0.422973
H  1.468107 4.873626 -1.270601
H  0.357322 3.824499 -2.17478
H  -5.438169 1.360002 0.506674
H  -3.857273 0.524526 4.648631
H  -4.805663 -0.946689 4.33967
H  -5.612376 0.527499 4.909849
H  -3.395748 0.849783 -3.458659
H  -2.882093 -0.637232 -2.646688
H  -1.994556 0.889101 -2.376621
elementType: Cl S O N C H
totalener: -2218.08560092 hartree
nucrepener: 3263.11166127 hartree
electener: -5481.19726219 hartree
oneelecener: -9537.32640636 hartree
twoeener: 4056.12914417 hartree
cpcmener: -0.03305477 hartree
kineticenergy: 2211.24341222 hartree
xcener: -164.126890987212 hartree
chargesum: 0.0000000
charge: -0.025161 0.875102 -0.478887 -0.481878 -0.267509 -0.449125 -0.458639 -0.291864 -0.288869 0.189856 -0.195462 -0.282960 -0.135666 -0.424376 -0.417237 -0.074580 -0.105586 0.080763 -0.151755 0.482096 0.369475 0.364074 0.415012 0.418396 -0.126969 -0.325242 -0.115909 -0.129154 0.224416 0.117840 0.130574 0.133261 0.190658 0.119652 0.129257 0.118180 0.144281 0.112757 0.113636 0.131709 0.138442 0.114712 0.112677
qa: -0.0252 0.8751 -0.4789 -0.4819 -0.2675 -0.4491 -0.4586 -0.2919 -0.2889 0.1899 -0.1955 -0.2830 -0.1357 -0.4244 -0.4172 -0.0746 -0.1056 0.0808 -0.1518 0.4821 0.3695 0.3641 0.4150 0.4184 -0.1270 -0.3252 -0.1159 -0.1292 0.2244 0.1178 0.1306 0.1333 0.1907 0.1197 0.1293 0.1182 0.1443 0.1128 0.1136 0.1317 0.1384 0.1147 0.1127
va: 1.2882 5.8957 2.0223 2.0169 2.1534 2.0410 2.0554 2.1309 2.1405 3.3863 3.0900 2.8667 3.1856 2.9684 2.9709 4.0376 3.7267 4.2814 3.8440 4.1098 4.4000 4.2530 4.0253 3.9947 3.8684 3.9352 3.8497 3.8409 1.0542 1.0082 1.0006 0.9924 1.0181 0.9937 0.9955 0.9923 1.0167 0.9959 0.9954 0.9935 0.9954 0.9922 1.0000
dispcorr: -0.025153308 hartree
energy: -2218.110754230850
dipole: -21.11948 19.41631 -1.70318 0.77111 0.63128 1.40239 2.30438 -1.16450 1.13988
magnitude: 2.48331 au
magnitude: 6.31208 debye
