program: Gaussian 09
title: 000074135
version: EM64L-G09RevD.01
frameworkgroup: C1[X(C12H16O)]
method: RPBEPBE
basis: SDD
operation: Freq
keyword: #pfreq=noraman
keyword: PBEPBE/SDD
title: #p freq=noraman PBEPBE/SDD
converged: YES YES NO NO
title: Mulliken charges:
elementType: O C C C C C C C C C C C C H H H H H H H H H H H H H H H H
charge: -0.442423 -0.206506 -0.459338 -0.474608 -0.437157 -0.425220 0.418840 -0.024423 -0.458407 0.322555 -0.244053 -0.415999 -0.877196 0.214963 0.237068 0.209606 0.219413 0.240188 0.217304 0.206935 0.195388 0.214704 0.234088 0.223646 0.229656 0.232668 0.231929 0.250329 0.366050
chargesum: 0.00000
title: Mulliken charges with hydrogens summed into heavy atoms:
elementType: O C C C C C C C C C C C C
charge: -0.076373 0.008457 -0.012664 -0.015006 -0.012918 -0.015128 0.418840 -0.024423 -0.224319 0.322555 -0.020406 -0.186343 -0.162272
polarizability: 1.64760785e+02 -2.36035644e+00 1.35154066e+02 1.49074158e-01 9.66408845e-01 8.60237069e+01
1716.lowfreq: -18.1425 -8.6403 -0.0005 0.0007 0.0007 9.7162 35.2946 69.0760 87.0868
frequency: 31.5289 69.0406 87.0537 152.5723 169.2439 187.1433 238.2187 251.5765 294.3021 296.9792 315.7788 336.2762 424.3596 498.6727 534.3593 539.5284 565.1197 587.6375 593.6875 673.4864 742.9483 777.6945 789.5856 818.5021 846.6329 858.1819 899.3700 902.1096 926.8298 945.3280 956.6779 964.5793 1005.7947 1019.7238 1041.3271 1054.4914 1070.8156 1085.0449 1142.2931 1155.2728 1167.7900 1173.6268 1212.5703 1222.8841 1233.3222 1257.3457 1269.6746 1278.5016 1293.0786 1299.2548 1304.2797 1309.1421 1352.9274 1388.8964 1399.0284 1445.2952 1459.8667 1461.8474 1467.7752 1471.2048 1479.0293 1483.4947 1490.0904 1599.0344 1618.2082 2948.2879 2974.6966 2979.1079 2996.4174 3006.2685 3010.4173 3014.7180 3048.2062 3058.4258 3075.8178 3085.3301 3085.7761 3117.8277 3126.0226 3157.1370 3574.3703
redmass: 2.5845 3.7612 3.0094 1.0820 2.6294 2.7782 2.7199 2.0702 3.2999 1.2545 3.9358 3.8711 2.9809 4.2165 2.6612 2.7877 3.7388 3.7074 3.6579 3.3063 2.9915 1.4639 1.7567 3.1480 2.4716 2.1369 1.7630 1.8255 1.7289 2.2387 1.5826 1.3694 1.7417 1.4259 1.5090 1.8913 3.9571 1.9043 1.3425 1.5918 1.5519 1.5850 1.5012 1.9902 1.2535 1.5719 2.1048 1.2988 1.1783 1.2642 1.3845 1.3693 1.6629 3.1934 1.4788 2.0566 2.2738 1.0908 1.0843 1.0930 1.0440 1.1185 1.3810 6.0220 6.9528 1.0404 1.0832 1.0631 1.0601 1.0612 1.0681 1.0980 1.0968 1.1024 1.1038 1.0999 1.0971 1.0864 1.0915 1.0988 1.0653
irintensity: 0.0596 0.8019 0.3806 0.1597 0.7285 0.8860 2.5226 1.0429 10.4988 91.8609 2.6164 7.9579 4.9861 1.6488 2.3579 2.1055 0.1272 1.4686 3.6692 2.3602 20.7696 42.5573 13.5558 12.7055 1.0558 4.2168 3.7332 2.8302 1.5835 13.2380 9.1782 0.3822 4.2643 1.0293 5.8999 8.6408 0.9565 19.6522 47.5249 41.2840 41.8037 33.3462 5.4543 1.1396 7.0524 9.6377 10.0154 0.0742 0.4631 0.5507 1.0784 0.3569 2.1358 2.4364 24.2462 32.0943 9.9416 1.4159 9.6269 6.1725 15.0237 16.5372 19.5663 3.5682 0.7892 38.2175 13.4808 52.5760 41.8930 69.0382 14.3523 24.1648 39.8369 32.9395 12.5538 70.8924 22.8799 1.8555 26.1405 29.2746 24.6649
temp: 298.150 k
press: 1.00000 atm
elementType: 8 6 6 6 6 6 6 6 6 6 6 6 6 1 1 1 1 1 1 1 1 1 1 1 1 1 1 1 1
symmnumber: 1
zpe: 653440.8 jmol-1
zpe.correction: 0.248882 hartree
zpe.thermalcorrener: 0.261355 hartree
zpe.thermalcorrenthalpy: 0.262299 hartree
zpe.thermalcorrgfe: 0.209962 hartree
zpe.sumelectzpe: -541.121723 hartree
zpe.sumelectthermal: -541.109251 hartree
zpe.sumelectthermalent: -541.108306 hartree
zpe.sumelectthermalfe: -541.160644 hartree
dipole: -1.4147 -1.2481 -0.0568
dipole: 1.8874
quadrupole: -73.4546 -69.8925 -82.5421
quadrupole: 5.1862 0.3553 0.6672
quadrupole: 1.8418 5.4039 -7.2457 5.1862 0.3553 0.6672
hfenergy: -541.3706057 hartree
pointgroup: C01 [X(C12H16O1)]
dipole: -0.5375286 0.5122158 0.0095883 debye
polarizability: 164.8968534|1.2273675|135.035185|-0.2113217|-0.2949117|86.0065202 unknown
charge 0 multiplicity 1
29 atoms
O  0.003442 1.752207 0.001086
C  1.35564 -0.798583 -0.035598
C  2.078275 -0.115345 -1.259841
C  2.082173 -0.227119 1.225705
C  3.314172 0.635155 -0.674678
C  3.527764 0.01707 0.732326
C  -0.159929 -0.663778 -0.019325
C  -0.817073 0.598574 0.002458
C  -0.983802 -1.81633 -0.023827
C  -2.233832 0.722889 0.022613
C  -2.393281 -1.728403 -0.004587
C  -3.010944 -0.459758 0.018752
C  -2.885539 2.096151 0.048269
H  1.5794 -1.883431 -0.076425
H  1.402038 0.583375 -1.778967
H  2.383222 -0.886574 -1.991082
H  2.017402 -0.918317 2.085673
H  1.619293 0.73217 1.516831
H  3.076229 1.709767 -0.566905
H  4.207675 0.551483 -1.319785
H  4.070047 -0.946485 0.649478
H  4.109398 0.671549 1.406872
H  -0.500328 -2.800784 -0.042639
H  -3.002739 -2.638201 -0.009183
H  -4.104397 -0.378117 0.033669
H  -2.603127 2.681174 0.947915
H  -2.629709 2.702922 -0.844981
H  -3.983824 2.001917 0.063176
H  -0.553145 2.570123 0.013401
