program: Gaussian 09
title: 000069123
version: EM64L-G09RevD.01
frameworkgroup: C1[X(C9H9NO4)]
method: RPBEPBE
basis: SDD
operation: Freq
keyword: #pfreq=noraman
keyword: PBEPBE/SDD
title: #p freq=noraman PBEPBE/SDD
converged: NO YES NO NO
title: Mulliken charges:
elementType: O O O O N C C C C C C C C C H H H H H H H H H
charge: -0.263993 -0.231689 -0.195671 -0.187878 0.021395 0.200312 0.267798 -0.347330 -0.333500 0.187565 -0.221033 -0.203338 -0.217974 -0.672680 0.273764 0.279200 0.245394 0.240139 0.229095 0.246417 0.212106 0.228666 0.243234
chargesum: 0.00000
title: Mulliken charges with hydrogens summed into heavy atoms:
elementType: O O O O N C C C C C C C C C
charge: -0.263993 -0.231689 -0.195671 -0.187878 0.021395 0.200312 0.267798 -0.073565 -0.054300 0.187565 0.024360 0.043079 0.251261 0.011326
polarizability: 1.54648159e+02 6.13161638e+00 1.29910789e+02 1.56179732e+01 -6.79711506e+00 7.18977964e+01
1716.lowfreq: -10.8336 -6.5380 -4.5881 0.0005 0.0008 0.0009 12.8911 44.6249 64.0390
frequency: 11.1322 44.6130 64.0386 75.2778 108.7358 135.2118 197.0572 205.6154 244.7063 269.9241 293.7805 342.7711 377.7373 397.6118 409.2982 524.7316 555.3424 636.2868 659.1278 673.4872 695.2009 758.5204 779.2072 787.0256 798.1658 810.5924 843.7662 897.6005 973.3922 1002.6381 1015.9021 1033.5654 1050.3204 1098.1874 1114.4907 1133.9650 1136.7768 1176.7834 1223.2555 1241.4955 1249.2732 1277.4098 1356.5569 1376.4785 1389.9354 1401.4766 1430.3590 1463.2686 1468.3436 1472.2899 1484.9105 1579.5366 1606.7600 1622.4355 2997.8515 3013.5088 3074.4279 3094.4530 3111.9859 3147.2556 3160.4654 3173.0995 3184.9695
redmass: 3.1742 5.8903 5.3521 2.7183 5.9909 5.4590 2.9484 4.0301 2.3385 2.7914 5.3542 6.2614 4.7945 7.6688 3.5609 4.5436 5.5156 6.7785 6.1576 7.6413 4.8666 4.2784 7.5301 1.5267 1.1251 4.2109 4.9494 1.4478 1.3923 1.3564 2.3233 2.7182 6.9174 2.6910 2.2183 1.4914 1.9544 1.0656 7.0590 2.9495 1.1518 1.6331 1.4244 10.2653 7.8235 1.2699 2.3766 1.0397 2.0174 1.2069 1.0680 6.6160 7.0689 11.5428 1.0359 1.0580 1.1069 1.0985 1.1029 1.0867 1.0912 1.0960 1.0990
irintensity: 1.5308 1.1448 2.6816 4.6681 0.1888 0.4411 0.8336 4.1440 0.2279 1.3760 4.2704 10.7356 1.0068 3.8536 1.2684 0.6537 6.0677 3.5153 1.1387 19.9921 43.7891 4.6540 16.8794 51.9761 2.6318 6.2065 11.7854 1.1789 2.3945 2.4944 15.4249 58.1902 78.8702 131.1956 3.7248 5.7846 2.9960 3.1922 88.4238 302.1710 4.2888 80.3316 0.6233 139.6086 8.6926 26.6810 11.4020 12.7612 13.5170 1.7833 13.0846 19.3936 9.4850 173.6683 17.8607 17.5774 5.7415 27.4796 34.8677 2.1026 4.8779 6.1720 8.1413
temp: 298.150 k
press: 1.00000 atm
elementType: 8 8 8 8 7 6 6 6 6 6 6 6 6 6 1 1 1 1 1 1 1 1 1
symmnumber: 1
zpe: 442225.9 jmol-1
zpe.correction: 0.168435 hartree
zpe.thermalcorrener: 0.181667 hartree
zpe.thermalcorrenthalpy: 0.182612 hartree
zpe.thermalcorrgfe: 0.126127 hartree
zpe.sumelectzpe: -702.894044 hartree
zpe.sumelectthermal: -702.880812 hartree
zpe.sumelectthermalent: -702.879867 hartree
zpe.sumelectthermalfe: -702.936352 hartree
dipole: -2.2388 -1.9169 -2.3040
dipole: 3.7411
quadrupole: -56.9152 -88.4174 -85.9900
quadrupole: 1.6041 -1.2296 3.8253
quadrupole: 20.1924 -11.3098 -8.8825 1.6041 -1.2296 3.8253
hfenergy: -703.062479 hartree
pointgroup: C01 [X(C9H9N1O4)]
dipole: -0.7398299 1.1841981 0.4654616 debye
dipolederiv: -1.428957 0.1941691 -0.3854833 0.2126224 -0.3571433 0.2308956 -0.5850912 0.1886317 -0.7092139 -0.7108264 -0.129424 0.2171446 -0.0035421 -0.4186863 0.2664796 -0.1168178 0.21223 -0.7973963 -0.3118572 0.0559259 0.1188946 0.0205923 -0.6246429 0.282677 0.154016 0.1870409 -0.5755485 -0.5269387 0.161431 0.2389963 0.1869122 -0.4795793 -0.0584237 0.2292775 0.0373883 -0.5258244 0.6480333 -0.458073 -0.3436469 -0.3928823 1.1579656 -0.2983258 -0.3228885 -0.2599504 0.9240178 -0.3080472 0.0439399 0.0340704 -0.0353396 0.0766588 0.0249 0.1787968 -0.0911469 -0.0467607 0.0462974 0.2353385 -0.0195536 0.2338307 -0.2409691 0.0852111 -0.1653551 0.0482128 0.00193 -0.1636177 0.1372892 -0.0466049 0.0518099 -0.0150141 -0.0637927 0.0370957 -0.1086197 -0.0684681 -0.132001 -0.0963675 0.0425752 0.0719942 0.0260523 -0.0722209 -0.0798097 0.0418812 -0.0780158 1.6612973 0.0554328 0.0138485 -0.177057 0.456435 -0.4962662 0.5124579 -0.3636624 1.2224697 0.066187 -0.1361933 0.0080245 -0.0739914 0.0837468 -0.0697825 -0.0197345 -0.0516205 -0.0916604 0.1416988 0.0033058 -0.0865598 -0.0876152 -0.1371155 0.0166398 -0.0603751 0.0146721 -0.1162713 0.9755336 -0.1129238 0.177791 -0.0515462 0.3324192 0.0080211 0.1134908 0.0077375 0.2760191 -0.0579823 0.0381617 -0.0766137 0.0516136 0.0116287 0.0602518 -0.0635186 0.0589252 -0.0304044 0.0814014 -0.0511115 0.0408055 -0.0390465 0.0407198 0.0478094 0.0060589 0.0715452 0.1218038 0.1062732 -0.0155777 0.0120655 -0.0268381 0.0408858 0.0515797 0.0615868 0.0288863 0.1393186 0.0340644 0.0821553 -0.005035 0.0973537 -0.0146647 0.0477658 -0.00061 0.0473413 0.1409613 -0.045256 0.0150937 -0.0546583 0.0346673 0.0232349 -0.0736182 0.0300554 -0.0736148 -0.0671802 -0.0570272 0.0012849 -0.0309305 -0.066791 -0.1040024 0.0451812 0.0205172 0.0383089 0.0655949 -0.0711124 0.0207313 0.0569388 0.0084501 0.0942983 0.0209523 0.0621538 0.0161865 0.1360003 -0.1732598 0.030765 0.0100234 0.0233667 0.1108287 0.0144573 0.0209826 0.0101424 0.0792173 0.1196312 0.0281955 0.055336 0.0247606 0.014866 -0.1068553 -0.0036888 -0.0805771 -0.0721341 0.1064654 -0.1035488 0.0225716 -0.0633244 -0.0779222 0.0364637 -0.0086002 0.0200615 0.0715454 unknown
polarizability: 151.4309273|-16.584121|117.8706013|-12.8972336|-25.632177|87.1552157 unknown
InChI: InChI=1S/C9H9NO4/c1-2-14-9(11)7-5-3-4-6-8(7)10(12)13/h3-6H,2H2,1H3
charge 0 multiplicity 1
23 atoms
O  1.866512 0.414719 0.368317
O  1.542646 1.43307 -1.707829
O  -0.604693 -2.298884 1.479295
O  0.563533 -1.914836 -0.442895
N  -0.289923 -1.572859 0.46013
C  -0.375289 0.829746 -0.328189
C  -1.005381 -0.28224 0.287039
C  -1.166156 1.972094 -0.596654
C  -2.360016 -0.250611 0.676317
C  1.08789 0.907459 -0.665462
C  -2.529923 2.012502 -0.232756
C  -3.12392 0.906573 0.417488
C  3.341721 0.345246 0.114067
C  3.964594 -0.305142 1.343474
H  -0.691167 2.828014 -1.08614
H  -2.796503 -1.130801 1.156054
H  -3.123304 2.906447 -0.449447
H  3.496442 -0.245903 -0.806057
H  3.708389 1.372572 -0.062104
H  -4.178596 0.936368 0.708402
H  5.058756 -0.383515 1.208173
H  3.768674 0.292266 2.250039
H  3.558815 -1.319185 1.496739
