program: Gaussian 09
title: 000069122
version: EM64L-G09RevD.01
frameworkgroup: C1[X(C8H5NO6)]
method: RPBEPBE
basis: SDD
operation: Freq
keyword: #pfreq=noraman
keyword: PBEPBE/SDD
title: #p freq=noraman PBEPBE/SDD
converged: YES YES NO NO
title: Mulliken charges:
elementType: O O O O O O N C C C C C C C C H H H H H
charge: -0.405264 -0.434642 -0.211841 -0.179150 -0.179776 -0.227060 0.022304 0.302372 0.237002 0.289616 -0.467300 -0.337678 -0.324652 0.111369 0.125503 0.318814 0.277623 0.290146 0.396767 0.395846
chargesum: 0.00000
title: Mulliken charges with hydrogens summed into heavy atoms:
elementType: O O O O O O N C C C C C C C C
charge: -0.008498 -0.038796 -0.211841 -0.179150 -0.179776 -0.227060 0.022304 0.302372 0.237002 0.289616 -0.148485 -0.060055 -0.034506 0.111369 0.125503
polarizability: 1.71032997e+02 3.08720606e+00 1.28621885e+02 4.54408559e+00 7.72489823e+00 5.53975494e+01
1716.lowfreq: -6.6988 0.0008 0.0009 0.0010 1.6149 5.9188 30.1561 54.5994 71.0277
frequency: 30.1452 54.5980 71.0261 93.9361 133.3914 145.8847 176.7712 204.5940 259.8848 280.7900 333.6914 367.2353 411.1193 449.3298 488.8236 518.5599 564.1033 575.7187 601.3746 614.4232 655.8777 660.9971 685.5746 713.8565 740.2105 747.5838 774.7268 865.3451 879.6270 963.9557 1001.9336 1014.1622 1039.4874 1068.4688 1139.7185 1161.3968 1166.1416 1222.1696 1259.0041 1316.8934 1331.3573 1375.8569 1383.1597 1412.6671 1488.7334 1567.4978 1619.8146 1647.3686 1650.4086 3165.2521 3176.6253 3189.2624 3527.5288 3534.6687
redmass: 13.2708 12.8289 6.6079 12.5099 9.3880 5.6786 8.0195 7.0707 8.0648 8.3247 9.1754 9.5832 3.5654 6.1241 8.2128 3.0247 1.6599 3.2628 3.3980 1.5997 7.7375 3.6653 5.1065 5.3997 6.1790 8.4267 4.6281 6.1060 1.5558 1.4947 1.3942 5.3760 3.5012 2.5064 1.6214 1.5789 2.1459 9.1426 1.3841 2.1960 3.2934 5.1092 11.8622 5.7305 3.1267 8.7181 7.1444 9.6859 9.5570 1.0904 1.0927 1.0965 1.0644 1.0644
irintensity: 1.2214 0.8076 0.4409 1.4364 0.2739 0.3146 3.9848 0.6275 0.9307 0.5335 1.8682 6.3298 5.6860 45.4529 9.1797 50.4961 37.5620 17.9278 6.0797 176.2639 17.2035 27.5905 24.7326 82.7087 24.8928 18.9314 9.9589 4.4252 30.8648 21.4327 1.2185 241.6828 266.6647 36.7280 78.0986 75.3028 21.2524 165.0390 4.5017 130.3151 17.1309 68.5424 79.0684 32.0782 24.5061 6.6900 9.0997 446.2929 42.2185 0.3348 9.0959 0.4807 59.2256 63.1620
temp: 298.150 k
press: 1.00000 atm
elementType: 8 8 8 8 8 8 7 6 6 6 6 6 6 6 6 1 1 1 1 1
symmnumber: 1
zpe: 332099.7 jmol-1
zpe.correction: 0.126490 hartree
zpe.thermalcorrener: 0.139558 hartree
zpe.thermalcorrenthalpy: 0.140502 hartree
zpe.thermalcorrgfe: 0.085358 hartree
zpe.sumelectzpe: -812.802264 hartree
zpe.sumelectthermal: -812.789196 hartree
zpe.sumelectthermalent: -812.788252 hartree
zpe.sumelectthermalfe: -812.843395 hartree
dipole: 2.6529 -3.8571 1.2924
dipole: 4.8565
quadrupole: -73.4533 -94.1498 -86.6279
quadrupole: -5.4804 -7.4180 -3.8738
quadrupole: 11.2904 -9.4061 -1.8842 -5.4804 -7.4180 -3.8738
hfenergy: -812.9287537 hartree
pointgroup: C01 [X(C8H5N1O6)]
dipole: -1.0667104 1.5440974 0.3585907 debye
dipolederiv: -0.6383808 0.1662905 -0.405927 0.145319 -0.481635 0.2025498 -0.5096801 0.1272814 -0.8496786 -0.9558007 0.4910418 -0.0404428 0.5892096 -0.7611002 0.0266377 -0.0481339 0.0278724 -0.4242933 -0.7610945 -0.2972271 0.121477 -0.2066562 -0.6215793 0.3194806 -0.0811533 0.1777877 -0.6024062 -0.4002979 0.0591981 0.1128082 0.0171329 -0.7238641 0.2329972 0.1319078 0.1401147 -0.3471704 -0.6761836 0.0106434 0.2477618 0.1271625 -0.4706888 0.0455875 0.2064252 0.1174431 -0.3636937 -0.8784594 -0.2530836 0.0167212 -0.1696184 -0.8323997 0.0339709 0.0105891 0.0393717 -0.3181889 1.0041574 -0.31854 -0.4073886 -0.3673 1.1876417 -0.3301994 -0.3224105 -0.2705303 0.5285681 -0.0892722 0.15158 0.0548596 0.1967176 -0.189517 0.0756554 -0.080635 0.0119344 0.0230558 -0.3207264 -0.0299667 -0.0339513 -0.1862459 0.1393011 0.0250079 0.1144757 -0.0204141 -0.0009338 -0.5101915 -0.0218798 -0.0067238 -0.1518374 -0.1178899 0.0042702 -0.0075819 0.0224564 0.0165101 0.0075426 -0.0508713 0.0065192 -0.0481017 -0.0462165 -0.0110972 -0.0625509 0.0298531 -0.0565124 -0.2840582 0.1713743 -0.0067449 0.0759122 0.0637169 -0.0187516 0.0372502 -0.0358636 -0.1070583 0.1631054 -0.1411231 0.0189128 0.1226704 0.0197689 -0.0122648 -0.0165799 -0.0146888 -0.0791449 1.5344781 0.3049639 0.2701654 0.212243 0.8116805 -0.5983194 0.4410617 -0.3609776 1.0980822 2.0035873 -0.0548461 0.0166598 -0.1405632 1.2881445 -0.0790048 0.0199165 -0.0851774 0.2473783 0.1536537 -0.0122476 -0.0081642 -0.0009726 0.0939893 0.0010395 0.0399146 -0.0113337 0.1646483 0.0781977 -0.0489592 0.0019793 -0.0301318 0.0104316 0.0055176 -0.0229617 0.0166541 0.150275 0.0892018 0.0498302 -0.0086144 0.0554396 0.0675754 0.0084509 0.000822 0.006306 0.1602455 0.2146801 -0.0765288 0.0428034 -0.0687048 0.3073877 0.0566175 0.1363336 0.0686094 0.3522865 0.2658611 -0.0996489 0.0072893 -0.1716748 0.2552529 0.0118547 0.012991 0.0133013 0.4080307 unknown
polarizability: 171.0926518|3.3981058|126.8247952|-2.7409281|-13.8694051|57.1349844 unknown
InChI: InChI=1S/C8H5NO6/c10-7(11)4-1-2-5(8(12)13)6(3-4)9(14)15/h1-3,10,12H
charge 0 multiplicity 1
20 atoms
O  3.067981 0.565814 1.120386
O  -4.0687 1.026507 -0.088854
O  2.971237 2.055765 -0.668194
O  1.088021 -2.759632 0.635429
O  2.528969 -1.538387 -0.649899
O  -3.725217 -1.266026 0.100006
N  1.44115 -1.681324 0.026627
C  0.499809 -0.529309 0.060272
C  0.980485 0.802859 -0.023932
C  -1.804846 0.236763 -0.011958
C  -0.872719 -0.823129 0.084193
C  0.032602 1.846586 -0.140827
C  -1.349678 1.572432 -0.13898
C  2.429274 1.193863 0.05484
C  -3.256952 -0.108791 0.007054
H  -1.219971 -1.857771 0.160238
H  0.395962 2.87513 -0.22394
H  -2.079991 2.380489 -0.227396
H  4.033365 0.807369 1.131958
H  -5.024382 0.75129 -0.071021
