program: Orca
programVersion: 4.2.1
elementType: S O O O O O O O N N N N N C C C C C C C C C C C C C C C H H H H H H H H H H H H H H H H H H H
charge: 0
multiplicity: 1
keywords: wb97x-d3
keywords: def2-TZVPP
keywords: def2/J RIJCOSX GRIDX6 NOFINALGRIDX
keywords: grid4 nofinalgrid
keywords: scfconv7
keywords: smallprint printgap noloewdin
keywords: NOSOSCF
formula: C15H19N5O7S
InChI: InChI=1S/C15H19N5O7S/c1-24-8-9-27-10-6-4-5-7-11(10)28(22,23)20-13(21)16-12-17-14(25-2)19-15(18-12)26-3/h4-7,16,20H,8-9H2,1-3H3
47 atoms
S  -2.289201 -1.660278 0.203376
O  -1.530141 0.752941 -1.223592
O  -2.893286 -2.524684 1.197668
O  -2.131027 -2.152276 -1.152843
O  0.914893 2.371861 -0.430477
O  -1.279286 -0.386294 2.680068
O  2.761595 -1.516556 -1.989937
O  5.217739 0.500421 1.191169
N  -0.733434 -1.297171 0.673189
N  0.867738 -0.254551 1.997475
N  3.071762 0.138674 1.594991
N  1.758275 -0.928351 -0.037782
N  4.038077 -0.543437 -0.452146
C  -3.149039 -0.126512 0.208116
C  -2.679096 0.94317 -0.568014
C  -4.324138 -0.029863 0.940769
C  -3.431938 2.115586 -0.591526
C  -0.939561 1.829406 -1.949396
C  -5.063324 1.138341 0.902534
C  -4.610891 2.199667 0.13236
C  -0.252109 2.84613 -1.059654
C  -0.45045 -0.633376 1.830988
C  1.931945 -0.350105 1.146598
C  2.037339 2.35009 -1.280628
C  2.838972 -0.985627 -0.794394
C  4.086108 0.010808 0.746055
C  1.497884 -2.003797 -2.448531
C  6.377805 0.442488 0.359063
H  -4.664679 -0.862908 1.538807
H  -3.118021 2.97216 -1.170304
H  0.008458 -1.352737 -0.035802
H  -1.681666 2.327313 -2.578056
H  -0.230513 1.354996 -2.628007
H  -5.979729 1.218161 1.46923
H  -5.17874 3.119359 0.093515
H  -0.034086 3.724637 -1.681127
H  -0.921971 3.182719 -0.265267
H  1.056798 0.20827 2.877308
H  2.159795 3.298783 -1.815284
H  2.924892 2.206632 -0.665565
H  1.998699 1.551792 -2.029963
H  0.75708 -1.205501 -2.499459
H  1.130993 -2.813847 -1.819249
H  1.676749 -2.383531 -3.44962
H  6.658954 -0.585744 0.137624
H  7.169111 0.91709 0.93129
H  6.228669 0.988727 -0.571139
elementType: S O N C H
totalener: -1781.75166514 hartree
nucrepener: 3151.70535010 hartree
electener: -4933.45701524 hartree
oneelecener: -8710.57586555 hartree
twoeener: 3777.11885032 hartree
cpcmener: -0.05929062 hartree
kineticenergy: 1775.29279104 hartree
xcener: -146.595227691433 hartree
chargesum: -0.0000000
charge: 0.884753 -0.311040 -0.517646 -0.521361 -0.375337 -0.469980 -0.274508 -0.279613 -0.193844 -0.110843 -0.379490 -0.394043 -0.373868 -0.153664 0.363211 -0.090414 -0.224609 -0.013628 -0.201554 -0.131981 0.023955 0.358060 0.362900 -0.151140 0.392342 0.442073 -0.118515 -0.113640 0.153665 0.147412 0.213313 0.118871 0.115733 0.166356 0.168104 0.097522 0.113887 0.195877 0.122873 0.124175 0.097952 0.101965 0.123871 0.141177 0.119194 0.133920 0.117559
qa: 0.8848 -0.3110 -0.5176 -0.5214 -0.3753 -0.4700 -0.2745 -0.2796 -0.1938 -0.1108 -0.3795 -0.3940 -0.3739 -0.1537 0.3632 -0.0904 -0.2246 -0.0136 -0.2016 -0.1320 0.0240 0.3581 0.3629 -0.1511 0.3923 0.4421 -0.1185 -0.1136 0.1537 0.1474 0.2133 0.1189 0.1157 0.1664 0.1681 0.0975 0.1139 0.1959 0.1229 0.1242 0.0980 0.1020 0.1239 0.1412 0.1192 0.1339 0.1176
va: 5.8215 2.0753 1.9759 1.9642 1.9029 2.0427 2.1303 2.1251 3.0848 3.2130 2.9525 2.9163 2.9014 3.7594 3.8142 3.9444 3.8831 3.8437 3.9462 3.9241 3.8665 4.4225 4.2343 3.9186 4.2663 4.2338 3.8508 3.8407 1.0137 1.0031 1.0668 1.0076 0.9898 0.9878 0.9857 1.0050 1.0007 1.0150 0.9966 0.9839 0.9765 0.9907 0.9928 0.9988 0.9954 0.9942 0.9948
dispcorr: -0.029355287 hartree
energy: -1781.781020426501
dipole: 9.21289 -7.46446 1.74843 17.00326 -13.70024 3.30302 -14.14916 11.50071 -2.64845
magnitude: 4.58053 au
magnitude: 11.64278 debye
