program: Gaussian 09
title: 000069121
version: EM64L-G09RevD.01
frameworkgroup: C1[X(C8H5NO6)]
method: RPBEPBE
basis: SDD
operation: Freq
keyword: #pfreq=noraman
keyword: PBEPBE/SDD
title: #p freq=noraman PBEPBE/SDD
converged: YES YES NO NO
title: Mulliken charges:
elementType: O O O O O O N C C C C C C C C H H H H H
charge: -0.408756 -0.425510 -0.214407 -0.216461 -0.193158 -0.186728 0.024928 0.258836 0.184124 -0.504819 0.418301 -0.291116 -0.360362 0.101538 0.122414 0.320768 0.285935 0.297311 0.393203 0.393960
chargesum: 0.00000
title: Mulliken charges with hydrogens summed into heavy atoms:
elementType: O O O O O O N C C C C C C C C
charge: -0.015553 -0.031550 -0.214407 -0.216461 -0.193158 -0.186728 0.024928 0.258836 0.184124 -0.184050 0.418301 -0.005181 -0.063051 0.101538 0.122414
polarizability: 1.69218350e+02 1.69187442e+00 1.32918163e+02 2.25878127e-01 -6.68659007e+00 5.33205189e+01
1716.lowfreq: -9.1444 -0.0006 -0.0004 -0.0002 2.4506 5.7400 28.8297 50.5869 75.8385
frequency: 28.8292 50.5864 75.8363 90.1401 133.1252 140.8499 170.9475 224.3743 270.2194 287.7352 324.2358 352.7328 418.3897 460.7227 496.6090 524.1379 574.8836 577.2931 594.0721 597.0446 628.5942 670.7693 702.6993 716.3706 732.2009 745.2791 792.2840 863.0906 877.5669 956.6910 1004.3224 1010.2225 1038.0413 1078.4157 1122.7702 1154.2445 1169.4948 1213.1057 1262.6995 1309.0154 1320.0652 1374.8658 1391.9732 1418.2721 1474.6272 1586.7618 1607.4331 1648.3240 1651.0664 3177.8868 3182.7043 3194.3449 3527.3361 3527.9311
redmass: 12.5199 14.2758 7.3732 10.6878 5.6892 8.5242 7.9616 7.6292 7.3846 9.8095 7.9478 7.7710 3.4363 4.9960 8.4714 3.8535 4.2589 1.7694 1.7160 2.3349 5.4641 3.9311 4.2687 5.8381 8.8484 8.8083 4.3169 7.7961 1.5138 1.4942 1.8627 2.7050 3.7076 1.9682 2.1249 1.6122 1.8103 9.6135 1.3946 2.5181 2.5887 9.4946 8.3340 5.0892 3.0550 8.5347 7.3094 9.3886 9.8950 1.0894 1.0929 1.0973 1.0643 1.0643
irintensity: 0.4637 0.0712 0.7960 1.2326 1.0563 0.9600 3.3737 6.3605 4.5249 1.4240 1.6328 0.3718 8.0197 9.8152 8.8972 43.5333 3.8811 78.6128 50.9788 138.7730 8.9268 3.1112 91.0171 13.7062 10.9949 43.7968 10.6270 10.8113 30.3921 32.7018 85.8344 110.6544 312.2380 38.3678 13.9948 63.1526 90.6820 230.8113 1.5484 36.7754 86.9751 127.5681 4.0420 24.8806 29.7032 9.3411 26.2689 302.3244 122.5629 1.9046 8.3513 1.1354 39.9234 68.6419
temp: 298.150 k
press: 1.00000 atm
elementType: 8 8 8 8 8 8 7 6 6 6 6 6 6 6 6 1 1 1 1 1
symmnumber: 1
zpe: 332108.7 jmol-1
zpe.correction: 0.126494 hartree
zpe.thermalcorrener: 0.139546 hartree
zpe.thermalcorrenthalpy: 0.140490 hartree
zpe.thermalcorrgfe: 0.085287 hartree
zpe.sumelectzpe: -812.802470 hartree
zpe.sumelectthermal: -812.789417 hartree
zpe.sumelectthermalent: -812.788473 hartree
zpe.sumelectthermalfe: -812.843676 hartree
dipole: 3.9775 -3.2514 1.5177
dipole: 5.3569
quadrupole: -94.4557 -79.9196 -86.9933
quadrupole: -1.5759 4.7650 6.6429
quadrupole: -7.3329 7.2033 0.1296 -1.5759 4.7650 6.6429
hfenergy: -812.9289632 hartree
pointgroup: C01 [X(C8H5N1O6)]
dipole: -1.5119773 1.283906 0.712239 debye
dipolederiv: -0.7483629 0.0200646 0.4447527 -0.0363032 -0.3561177 0.0829164 0.481709 0.1414036 -0.8411695 -0.4786862 0.3320157 0.1635025 0.3923701 -1.065749 -0.292992 0.2234362 -0.2876641 -0.5235658 -0.4697979 -0.168258 0.100742 -0.0971175 -0.8659761 -0.3193393 0.1632064 -0.0923004 -0.5869573 -0.920919 -0.1200259 -0.2136915 0.0222479 -0.6332086 -0.172148 -0.0942717 -0.2015055 -0.4379958 -0.7840205 -0.1966192 0.0204225 -0.1264882 -0.5841631 -0.0046404 0.0250785 -0.0027037 -0.2191864 -0.6456153 0.1628496 0.0257768 0.138582 -0.6841379 -0.0172819 0.0263181 -0.0223441 -0.2133302 1.7230385 -0.0545564 -0.0690471 -0.1174797 1.0739309 0.0325819 -0.0912216 0.0295929 0.192962 -0.1616236 -0.0157753 0.0467532 -0.1598926 -0.1636561 -0.0104028 -0.0558245 -0.0497629 -0.0215251 -0.3446591 0.1296805 0.0032877 0.1674499 0.0910069 -0.0547457 0.0411266 0.0360678 0.0115885 0.0171781 -0.1222758 -0.0105199 0.0482366 -0.0955812 -0.003273 -0.040576 -0.0077729 -0.0768898 -0.4830008 0.0843893 0.0173069 0.174012 0.0634645 -0.0080259 0.045441 -0.0007136 0.0788558 -0.2238135 -0.2102976 -0.007539 -0.0524394 0.0357159 0.0099678 0.0557131 0.0296359 -0.0912497 0.0990777 0.1677001 -0.0007904 -0.1760798 -0.0830113 0.0141537 -0.0017878 -0.005944 -0.0953747 1.0253981 0.391051 -0.5851487 0.3907478 1.2041728 0.3117818 -0.5717848 0.0759372 1.052436 1.5738695 -0.292732 0.1380729 -0.4290456 1.3003201 0.5305345 -0.0064787 0.4783942 0.5554211 0.1479867 0.0220505 -0.0031154 0.0073414 0.095852 -0.0003021 0.0191468 0.0068283 0.1661847 0.0979265 0.0268102 0.0009789 0.0289848 0.0183027 0.0004197 -0.0320491 -0.0069242 0.1534371 0.0965936 -0.0519896 -0.0025365 -0.0268777 0.0960406 -0.0009049 0.0003738 0.0036275 0.1720887 0.3105433 -0.0690424 0.0024343 -0.0634224 0.1889187 -0.0699126 -0.0627861 -0.1233496 0.3547624 0.1688867 -0.0350392 -0.0716417 -0.0848264 0.363876 -0.0283874 -0.1247693 -0.0005024 0.369508 unknown
polarizability: 168.8950958|1.7100589|132.5129236|-6.440114|8.5173626|54.0490129 unknown
InChI: InChI=1S/C8H5NO6/c10-7(11)5-2-1-4(9(14)15)3-6(5)8(12)13/h1-3,10,12H
charge 0 multiplicity 1
20 atoms
O  -2.302042 -1.667607 1.157166
O  -2.673844 2.317883 0.52688
O  -1.286786 -2.829018 -0.586331
O  -3.253762 0.370534 -0.601205
O  4.089013 0.893733 -0.166455
O  3.63429 -1.341726 -0.226512
N  3.274327 -0.106094 -0.161448
C  -0.475665 -0.608388 0.025543
C  -0.927073 0.743163 0.065251
C  0.905368 -0.882442 -0.068149
C  1.816985 0.190541 -0.073607
C  0.018186 1.799855 0.07096
C  1.398456 1.533951 0.008946
C  -1.388136 -1.799732 0.113826
C  -2.385209 1.070948 -0.037864
H  1.268695 -1.911879 -0.126575
H  -0.345505 2.829392 0.11066
H  2.142761 2.333977 0.011143
H  -2.919157 -2.448296 1.164621
H  -3.641302 2.516905 0.406051
