program: Orca
programVersion: 4.2.1
elementType: S O O O O O O O N N N N N C C C C C C C C C C C C C C C H H H H H H H H H H H H H H H H H H H
charge: 0
multiplicity: 1
keywords: wb97x-d3
keywords: def2-TZVPP
keywords: def2/J RIJCOSX GRIDX6 NOFINALGRIDX
keywords: grid4 nofinalgrid
keywords: scfconv7
keywords: smallprint printgap noloewdin
keywords: NOSOSCF
formula: C15H19N5O7S
InChI: InChI=1S/C15H19N5O7S/c1-24-8-9-27-10-6-4-5-7-11(10)28(22,23)20-13(21)16-12-17-14(25-2)19-15(18-12)26-3/h4-7,16,20H,8-9H2,1-3H3
47 atoms
S  -2.270742 -1.596139 -0.223583
O  -0.970905 0.884094 0.594292
O  -1.990697 -1.972217 1.149998
O  -3.097163 -2.466622 -1.035897
O  0.116122 1.139568 3.250867
O  -1.443681 -0.686556 -2.929341
O  2.821781 -1.217473 1.635008
O  5.052345 0.616298 -1.811585
N  -0.758038 -1.483011 -0.914403
N  0.74229 -0.499124 -2.395509
N  2.927344 0.073054 -2.108398
N  1.74349 -0.937272 -0.346322
N  3.980952 -0.301527 -0.025469
C  -2.954004 0.026943 -0.279907
C  -2.22886 1.121683 0.215999
C  -4.25448 0.171667 -0.743689
C  -2.852967 2.366442 0.241046
C  -0.127889 1.944664 1.033264
C  -4.86275 1.413493 -0.708376
C  -4.156106 2.499163 -0.212854
C  -0.296588 2.252472 2.498971
C  -0.559063 -0.879178 -2.124532
C  1.841415 -0.455975 -1.581413
C  -0.069689 1.321822 4.633848
C  2.834347 -0.81352 0.390205
C  3.967023 0.109685 -1.280301
C  1.62068 -1.78677 2.16744
C  6.238477 0.707804 -1.020158
H  -4.795026 -0.68059 -1.12998
H  -2.342285 3.242299 0.614558
H  0.038161 -1.471408 -0.262268
H  -0.279688 2.845528 0.435487
H  0.889008 1.602009 0.839606
H  -5.876303 1.529415 -1.064146
H  -4.62105 3.475087 -0.177673
H  0.313993 3.137423 2.725304
H  -1.337152 2.520763 2.72907
H  0.873698 -0.104566 -3.31842
H  -1.126106 1.457026 4.893146
H  0.29586 0.429516 5.140594
H  0.485395 2.186638 5.014959
H  1.368307 -2.7157 1.657939
H  0.78853 -1.087453 2.114262
H  1.839174 -2.000592 3.209262
H  6.988583 1.146207 -1.671367
H  6.574776 -0.274138 -0.691478
H  6.090491 1.352024 -0.155052
elementType: S O N C H
totalener: -1781.75099235 hartree
nucrepener: 3118.62172169 hartree
electener: -4900.37271404 hartree
oneelecener: -8644.33437887 hartree
twoeener: 3743.96166483 hartree
cpcmener: -0.05878887 hartree
kineticenergy: 1775.29630136 hartree
xcener: -146.592412510922 hartree
chargesum: -0.0000000
charge: 0.886201 -0.305070 -0.517677 -0.518158 -0.360471 -0.462767 -0.274883 -0.279476 -0.197058 -0.122894 -0.393228 -0.428609 -0.391042 -0.183157 0.394730 -0.091626 -0.205288 -0.017522 -0.200108 -0.145594 0.032969 0.350811 0.383974 -0.109376 0.424735 0.473490 -0.116363 -0.114429 0.154047 0.141029 0.213198 0.132158 0.109421 0.166445 0.167772 0.099372 0.083453 0.196952 0.096193 0.104878 0.095626 0.134662 0.081529 0.139912 0.133728 0.118906 0.118607
qa: 0.8862 -0.3051 -0.5177 -0.5182 -0.3605 -0.4628 -0.2749 -0.2795 -0.1971 -0.1229 -0.3932 -0.4286 -0.3910 -0.1832 0.3947 -0.0916 -0.2053 -0.0175 -0.2001 -0.1456 0.0330 0.3508 0.3840 -0.1094 0.4247 0.4735 -0.1164 -0.1144 0.1540 0.1410 0.2132 0.1322 0.1094 0.1664 0.1678 0.0994 0.0835 0.1970 0.0962 0.1049 0.0956 0.1347 0.0815 0.1399 0.1337 0.1189 0.1186
va: 5.8109 2.0785 1.9652 1.9719 1.9286 2.0471 2.1317 2.1306 3.0843 3.2078 2.9738 2.9339 2.9270 3.7777 3.7867 3.9449 3.8927 3.8629 3.9469 3.9367 3.9212 4.4241 4.2281 3.9095 4.2636 4.2198 3.8323 3.8393 1.0139 1.0106 1.0747 1.0007 1.0116 0.9881 0.9860 0.9989 0.9936 1.0138 0.9897 0.9925 0.9882 0.9930 1.0087 0.9979 0.9938 0.9957 0.9958
dispcorr: -0.027489459 hartree
energy: -1781.778481809779
dipole: 6.26324 -4.21474 2.04851 16.30426 -12.52592 3.77834 20.23858 -18.37838 1.86020
magnitude: 4.68322 au
magnitude: 11.90380 debye
