program: Orca
programVersion: 4.2.1
elementType: S O O O O O O O N N N N N C C C C C C C C C C C C C C C H H H H H H H H H H H H H H H H H H H
charge: 0
multiplicity: 1
keywords: wb97x-d3
keywords: def2-TZVPP
keywords: def2/J RIJCOSX GRIDX6 NOFINALGRIDX
keywords: grid4 nofinalgrid
keywords: scfconv7
keywords: smallprint printgap noloewdin
keywords: NOSOSCF
formula: C15H19N5O7S
InChI: InChI=1S/C15H19N5O7S/c1-24-8-9-27-10-6-4-5-7-11(10)28(22,23)20-13(21)16-12-17-14(25-2)19-15(18-12)26-3/h4-7,16,20H,8-9H2,1-3H3
47 atoms
S  -2.303861 -1.432459 -0.583644
O  -1.433555 1.363692 -0.280921
O  -2.969892 -2.675199 -0.245919
O  -2.029488 -1.13935 -1.97912
O  0.715903 2.252233 -1.937581
O  -1.495305 -1.491602 2.277349
O  2.91269 -0.753479 -2.124392
O  5.057267 -0.039491 1.763425
N  -0.795317 -1.413916 0.119512
N  0.688348 -1.075876 1.876802
N  2.904094 -0.547822 1.832226
N  1.750586 -0.929845 -0.18019
N  4.03595 -0.397721 -0.238556
C  -3.198682 -0.111653 0.158615
C  -2.675522 1.189927 0.180143
C  -4.467235 -0.386874 0.651478
C  -3.468846 2.208216 0.704748
C  -0.853016 2.661583 -0.178165
C  -5.245088 0.635473 1.163977
C  -4.738662 1.926083 1.183042
C  0.592327 2.605795 -0.582991
C  -0.605445 -1.344076 1.467906
C  1.819202 -0.842749 1.144295
C  1.994696 2.545877 -2.450691
C  2.884151 -0.694373 -0.817209
C  3.979732 -0.336334 1.07983
C  1.698362 -1.028957 -2.830586
C  6.276433 0.221539 1.064999
H  -4.851434 -1.396629 0.637898
H  -3.112024 3.227185 0.742571
H  0.006827 -1.192502 -0.484863
H  -0.898811 3.017576 0.854538
H  -1.398973 3.368816 -0.809246
H  -6.233678 0.423605 1.54455
H  -5.336373 2.735036 1.580823
H  1.002977 3.606261 -0.39341
H  1.147448 1.911764 0.063566
H  0.801401 -1.020137 2.881108
H  2.799126 2.096559 -1.859055
H  2.05259 2.153603 -3.465018
H  2.176586 3.626019 -2.486482
H  1.326772 -2.026831 -2.600611
H  1.95614 -0.978176 -3.883879
H  0.935191 -0.283342 -2.611941
H  6.607123 -0.649678 0.502302
H  7.007328 0.452141 1.834024
H  6.17611 1.073574 0.394984
elementType: S O N C H
totalener: -1781.75432836 hartree
nucrepener: 3128.61774741 hartree
electener: -4910.37207577 hartree
oneelecener: -8664.31367705 hartree
twoeener: 3753.94160128 hartree
cpcmener: -0.05958360 hartree
kineticenergy: 1775.29483654 hartree
xcener: -146.592985225795 hartree
chargesum: 0.0000000
charge: 0.886427 -0.305486 -0.519240 -0.521776 -0.379507 -0.468463 -0.273226 -0.279001 -0.192337 -0.117570 -0.392925 -0.407210 -0.381347 -0.157452 0.381590 -0.087999 -0.222249 0.010828 -0.203526 -0.134471 0.006158 0.359761 0.368693 -0.131477 0.395945 0.476797 -0.140149 -0.116066 0.153101 0.146985 0.208343 0.111538 0.116228 0.166381 0.168447 0.110224 0.079025 0.197043 0.089442 0.122249 0.118042 0.137689 0.146994 0.100518 0.119495 0.133719 0.119815
qa: 0.8864 -0.3055 -0.5192 -0.5218 -0.3795 -0.4685 -0.2732 -0.2790 -0.1923 -0.1176 -0.3929 -0.4072 -0.3813 -0.1575 0.3816 -0.0880 -0.2222 0.0108 -0.2035 -0.1345 0.0062 0.3598 0.3687 -0.1315 0.3959 0.4768 -0.1401 -0.1161 0.1531 0.1470 0.2083 0.1115 0.1162 0.1664 0.1684 0.1102 0.0790 0.1970 0.0894 0.1222 0.1180 0.1377 0.1470 0.1005 0.1195 0.1337 0.1198
va: 5.8055 2.1089 1.9719 1.9609 1.9010 2.0430 2.1243 2.1321 3.0805 3.2113 2.9662 2.9203 2.9117 3.7472 3.8218 3.9357 3.8976 3.8918 3.9492 3.9291 3.9565 4.4160 4.2287 3.8903 4.2605 4.2115 3.8119 3.8412 1.0142 1.0068 1.0748 0.9931 0.9956 0.9881 0.9859 0.9983 0.9936 1.0142 0.9869 0.9873 0.9958 0.9933 0.9957 1.0096 0.9955 0.9937 0.9949
dispcorr: -0.028321534 hartree
energy: -1781.782649892854
dipole: 11.59837 -9.17140 2.42698 19.54773 -15.88593 3.66180 -7.27873 7.69130 0.41257
magnitude: 4.41239 au
magnitude: 11.21540 debye
