program: Orca
programVersion: 4.2.1
elementType: S O O O O O O O N N N N N C C C C C C C C C C C C C C C H H H H H H H H H H H H H H H H H H H
charge: 0
multiplicity: 1
keywords: wb97x-d3
keywords: def2-TZVPP
keywords: def2/J RIJCOSX GRIDX6 NOFINALGRIDX
keywords: grid4 nofinalgrid
keywords: scfconv7
keywords: smallprint printgap noloewdin
keywords: NOSOSCF
formula: C15H19N5O7S
InChI: InChI=1S/C15H19N5O7S/c1-24-8-9-27-10-6-4-5-7-11(10)28(22,23)20-13(21)16-12-17-14(25-2)19-15(18-12)26-3/h4-7,16,20H,8-9H2,1-3H3
47 atoms
S  -2.342084 -1.663257 0.550787
O  -1.32892 0.375581 -1.255923
O  -3.022948 -2.253097 1.685775
O  -2.227232 -2.428263 -0.677162
O  0.977327 2.008772 -0.488102
O  -1.218496 -0.088427 2.801971
O  2.495018 -1.735151 -1.958738
O  5.08813 0.779575 0.717855
N  -0.761584 -1.353979 0.969591
N  0.913433 -0.173923 2.060575
N  3.045839 0.276452 1.407311
N  1.666384 -1.053562 0.046226
N  3.813796 -0.46631 -0.699638
C  -3.074402 -0.097841 0.214904
C  -2.500802 0.755332 -0.740004
C  -4.276974 0.213591 0.834458
C  -3.184867 1.921454 -1.074098
C  -0.600006 1.241175 -2.121857
C  -4.940742 1.379774 0.498405
C  -4.392487 2.21786 -0.461352
C  0.022491 2.428239 -1.429258
C  -0.424796 -0.509294 1.988651
C  1.903892 -0.32026 1.128855
C  1.503798 3.102718 0.224923
C  2.645112 -1.070679 -0.838336
C  3.957785 0.171178 0.447418
C  1.277455 -2.449277 -2.184815
C  6.153006 0.72436 -0.23262
H  -4.698762 -0.452309 1.573625
H  -2.796083 2.604806 -1.815242
H  -0.04294 -1.521815 0.250941
H  -1.229086 1.589935 -2.94483
H  0.176617 0.612585 -2.556795
H  -5.877599 1.626582 0.976622
H  -4.906938 3.126961 -0.741905
H  0.480994 3.045752 -2.214673
H  -0.74078 3.056364 -0.95125
H  1.149928 0.414988 2.849078
H  1.975665 3.837448 -0.437884
H  0.731895 3.620619 0.806516
H  2.259512 2.731803 0.914283
H  1.099797 -3.192172 -1.408408
H  1.407866 -2.953194 -3.13755
H  0.424113 -1.775365 -2.255174
H  6.968614 1.286914 0.211691
H  5.869274 1.185972 -1.176993
H  6.476272 -0.300272 -0.409706
elementType: S O N C H
totalener: -1781.75122132 hartree
nucrepener: 3180.37222442 hartree
electener: -4962.12344575 hartree
oneelecener: -8767.98947161 hartree
twoeener: 3805.86602586 hartree
cpcmener: -0.05676337 hartree
kineticenergy: 1775.30292058 hartree
xcener: -146.596913286070 hartree
chargesum: 0.0000000
charge: 0.886268 -0.317398 -0.517924 -0.520956 -0.338536 -0.469102 -0.279708 -0.284018 -0.196864 -0.115622 -0.407033 -0.406419 -0.385193 -0.161588 0.374345 -0.091343 -0.222996 -0.003975 -0.201543 -0.135215 0.004588 0.356443 0.374555 -0.119178 0.414956 0.478051 -0.120835 -0.115435 0.153922 0.146782 0.213694 0.130056 0.110811 0.166782 0.168528 0.098682 0.091212 0.195279 0.105689 0.103197 0.099952 0.127113 0.140664 0.098500 0.133251 0.118250 0.119310
qa: 0.8863 -0.3174 -0.5179 -0.5210 -0.3385 -0.4691 -0.2797 -0.2840 -0.1969 -0.1156 -0.4070 -0.4064 -0.3852 -0.1616 0.3743 -0.0913 -0.2230 -0.0040 -0.2015 -0.1352 0.0046 0.3564 0.3746 -0.1192 0.4150 0.4781 -0.1208 -0.1154 0.1539 0.1468 0.2137 0.1301 0.1108 0.1668 0.1685 0.0987 0.0912 0.1953 0.1057 0.1032 0.1000 0.1271 0.1407 0.0985 0.1333 0.1183 0.1193
va: 5.8201 2.0810 1.9743 1.9632 1.9413 2.0404 2.1252 2.1232 3.0805 3.2050 2.9372 2.9412 2.9249 3.7750 3.7953 3.9450 3.8957 3.8897 3.9473 3.9257 3.8981 4.4274 4.2414 3.8847 4.2811 4.1937 3.8499 3.8393 1.0136 1.0056 1.0728 1.0003 0.9951 0.9878 0.9858 0.9986 0.9913 1.0144 0.9907 0.9925 1.0016 0.9910 0.9988 0.9920 0.9940 0.9953 0.9959
dispcorr: -0.029720293 hartree
energy: -1781.780941617913
dipole: 8.47938 -6.66481 1.81457 17.82893 -14.45310 3.37583 -12.82140 10.07108 -2.75032
magnitude: 4.71733 au
magnitude: 11.99050 debye
