program: Orca
programVersion: 4.2.1
elementType: S O O O O O O O N N N N N C C C C C C C C C C C C C C C H H H H H H H H H H H H H H H H H H H
charge: 0
multiplicity: 1
keywords: wb97x-d3
keywords: def2-TZVPP
keywords: def2/J RIJCOSX GRIDX6 NOFINALGRIDX
keywords: grid4 nofinalgrid
keywords: scfconv7
keywords: smallprint printgap noloewdin
keywords: NOSOSCF
formula: C15H19N5O7S
InChI: InChI=1S/C15H19N5O7S/c1-24-8-9-27-10-6-4-5-7-11(10)28(22,23)20-13(21)16-12-17-14(25-2)19-15(18-12)26-3/h4-7,16,20H,8-9H2,1-3H3
47 atoms
S  -2.169755 -1.177251 0.85392
O  -1.799317 1.733878 1.056058
O  -1.812742 -0.92049 2.235724
O  -2.741049 -2.466306 0.512552
O  0.928741 3.178799 1.434255
O  -1.642678 -1.183275 -2.043217
O  5.122155 -0.79577 -2.290525
O  3.255807 -1.14917 1.778929
N  -0.73289 -0.981708 0.023725
N  0.597259 -0.984309 -1.89069
N  1.926681 -1.071551 0.009442
N  2.852025 -0.874554 -2.147105
N  4.262811 -0.969131 -0.257266
C  -3.23217 0.076428 0.228486
C  -2.939683 1.433531 0.434177
C  -4.391919 -0.319459 -0.425548
C  -3.850727 2.379742 -0.034138
C  -1.540182 3.098343 1.384687
C  -5.288836 0.630247 -0.877712
C  -5.008892 1.974042 -0.677265
C  -0.262293 3.207295 2.184615
C  -0.665257 -1.070074 -1.335299
C  1.830823 -0.973929 -1.303355
C  1.285492 1.910756 0.931257
C  4.035146 -0.88196 -1.564993
C  3.175447 -1.057456 0.47517
C  5.007261 -0.68993 -3.711169
C  4.545675 -1.18046 2.394143
H  -4.598257 -1.368158 -0.58171
H  -3.668644 3.436583 0.096514
H  0.138914 -0.940845 0.563272
H  -2.359656 3.488773 1.995665
H  -1.471631 3.706432 0.477584
H  -6.192866 0.322821 -1.383267
H  -5.700739 2.727656 -1.028623
H  -0.285969 4.181264 2.676944
H  -0.254922 2.446124 2.976061
H  0.600117 -0.965103 -2.902468
H  0.679463 1.616379 0.06996
H  2.325787 1.968937 0.608493
H  1.205708 1.135367 1.700452
H  4.507191 -1.558666 -4.135888
H  6.026907 -0.64437 -4.081448
H  4.477266 0.216067 -4.000559
H  5.125979 -2.036683 2.05448
H  4.356631 -1.272517 3.459271
H  5.099898 -0.263075 2.20326
elementType: S O N C H
totalener: -1781.75164623 hartree
nucrepener: 3056.23159082 hartree
electener: -4837.98323704 hartree
oneelecener: -8519.93848615 hartree
twoeener: 3681.95524911 hartree
cpcmener: -0.05760865 hartree
kineticenergy: 1775.27991859 hartree
xcener: -146.589874181597 hartree
chargesum: -0.0000000
charge: 0.887897 -0.303344 -0.521364 -0.518701 -0.403665 -0.474657 -0.280625 -0.283335 -0.203796 -0.126003 -0.413969 -0.427512 -0.393443 -0.146447 0.366262 -0.081993 -0.220196 0.004224 -0.200255 -0.134540 0.009421 0.390251 0.392000 -0.096583 0.451635 0.448523 -0.116012 -0.114724 0.150827 0.146512 0.209154 0.121964 0.109580 0.167007 0.167697 0.110714 0.086313 0.196729 0.085604 0.127491 0.083535 0.119185 0.133964 0.119953 0.121279 0.134852 0.118590
qa: 0.8879 -0.3033 -0.5214 -0.5187 -0.4037 -0.4747 -0.2806 -0.2833 -0.2038 -0.1260 -0.4140 -0.4275 -0.3934 -0.1464 0.3663 -0.0820 -0.2202 0.0042 -0.2003 -0.1345 0.0094 0.3903 0.3920 -0.0966 0.4516 0.4485 -0.1160 -0.1147 0.1508 0.1465 0.2092 0.1220 0.1096 0.1670 0.1677 0.1107 0.0863 0.1967 0.0856 0.1275 0.0835 0.1192 0.1340 0.1200 0.1213 0.1349 0.1186
va: 5.8091 2.1017 1.9649 1.9768 1.9250 2.0425 2.1288 2.1289 3.0886 3.1943 2.9234 2.9577 2.9316 3.7520 3.8566 3.9019 3.8909 3.7424 3.9358 3.9344 3.9662 4.3897 4.2104 3.9125 4.2605 4.1811 3.8421 3.8369 1.0160 1.0063 1.0613 0.9943 0.9971 0.9876 0.9860 0.9962 1.0092 1.0144 0.9956 0.9991 0.9981 0.9950 0.9939 0.9946 0.9964 0.9931 0.9954
dispcorr: -0.026143986 hartree
energy: -1781.777790211239
dipole: 9.58571 -7.80227 1.78344 15.73786 -13.21351 2.52436 1.20603 -2.50887 -1.30283
magnitude: 3.35416 au
magnitude: 8.52561 debye
