program: Orca
programVersion: 4.2.1
elementType: S O O O O O O O N N N N N C C C C C C C C C C C C C C C H H H H H H H H H H H H H H H H H H H
charge: 0
multiplicity: 1
keywords: wb97x-d3
keywords: def2-TZVPP
keywords: def2/J RIJCOSX GRIDX6 NOFINALGRIDX
keywords: grid4 nofinalgrid
keywords: scfconv7
keywords: smallprint printgap noloewdin
keywords: NOSOSCF
formula: C15H19N5O7S
InChI: InChI=1S/C15H19N5O7S/c1-24-8-9-27-10-6-4-5-7-11(10)28(22,23)20-13(21)16-12-17-14(25-2)19-15(18-12)26-3/h4-7,16,20H,8-9H2,1-3H3
47 atoms
S  -2.30266 -1.569784 -0.047901
O  -1.595212 1.161702 -0.836466
O  -2.860063 -2.645965 0.747281
O  -2.18723 -1.744014 -1.484349
O  1.167221 2.120462 -1.067906
O  -1.231377 -0.709707 2.572271
O  2.8411 -1.563451 -2.140909
O  5.301096 0.318948 1.034241
N  -0.732503 -1.291499 0.437098
N  0.888238 -0.415415 1.853944
N  3.095029 -0.00773 1.489093
N  1.800244 -1.008523 -0.197329
N  4.099941 -0.664248 -0.545958
C  -3.185465 -0.094348 0.330671
C  -2.753708 1.141351 -0.17259
C  -4.353741 -0.203868 1.072714
C  -3.541686 2.263388 0.075632
C  -1.179544 2.38437 -1.43738
C  -5.124585 0.91913 1.313003
C  -4.712435 2.143115 0.807783
C  0.175018 2.207637 -2.062289
C  -0.42383 -0.809211 1.674066
C  1.956959 -0.480108 1.006331
C  2.458925 2.255804 -1.609837
C  2.90369 -1.065722 -0.928894
C  4.123639 -0.1257 0.664923
C  1.578284 -2.001759 -2.645948
C  5.441868 0.941597 2.312461
H  -4.665626 -1.163047 1.460253
H  -3.25646 3.237585 -0.294038
H  -0.003852 -1.265062 -0.28522
H  -1.135684 3.185721 -0.694365
H  -1.892292 2.676676 -2.213293
H  -6.035869 0.837034 1.887565
H  -5.305868 3.029469 0.987035
H  0.187294 1.329788 -2.723098
H  0.340094 3.085775 -2.70018
H  1.087121 -0.042145 2.773422
H  3.177185 2.244383 -0.790937
H  2.706616 1.452266 -2.312776
H  2.578197 3.205982 -2.143964
H  1.779596 -2.388959 -3.639967
H  0.872955 -1.173842 -2.725622
H  1.153842 -2.795535 -2.032605
H  5.187817 0.258176 3.120788
H  4.829269 1.838947 2.387206
H  6.489748 1.215499 2.388343
elementType: S O N C H
totalener: -1781.75330652 hartree
nucrepener: 3134.68839879 hartree
electener: -4916.44170531 hartree
oneelecener: -8676.60539617 hartree
twoeener: 3760.16369086 hartree
cpcmener: -0.05773467 hartree
kineticenergy: 1775.29488716 hartree
xcener: -146.592353179266 hartree
chargesum: -0.0000000
charge: 0.884777 -0.300517 -0.518212 -0.521269 -0.364341 -0.468627 -0.274779 -0.279629 -0.187984 -0.119572 -0.412318 -0.400977 -0.346244 -0.166919 0.383685 -0.084717 -0.219887 0.018686 -0.202973 -0.131225 -0.000129 0.362236 0.374906 -0.154445 0.408456 0.434634 -0.127814 -0.115513 0.152733 0.145314 0.206694 0.097900 0.122583 0.165750 0.168250 0.086885 0.098541 0.197971 0.125268 0.097188 0.119766 0.140984 0.107909 0.124924 0.118666 0.119356 0.134032
qa: 0.8848 -0.3005 -0.5182 -0.5213 -0.3643 -0.4686 -0.2748 -0.2796 -0.1880 -0.1196 -0.4123 -0.4010 -0.3462 -0.1669 0.3837 -0.0847 -0.2199 0.0187 -0.2030 -0.1312 -0.0001 0.3622 0.3749 -0.1544 0.4085 0.4346 -0.1278 -0.1155 0.1527 0.1453 0.2067 0.0979 0.1226 0.1658 0.1682 0.0869 0.0985 0.1980 0.1253 0.0972 0.1198 0.1410 0.1079 0.1249 0.1187 0.1194 0.1340
va: 5.8094 2.1087 1.9740 1.9639 1.9150 2.0440 2.1275 2.1203 3.0896 3.2129 2.9393 2.9262 2.9340 3.7481 3.8195 3.9295 3.8973 3.8609 3.9494 3.9284 3.9743 4.4164 4.2396 3.9183 4.2423 4.2434 3.8524 3.8436 1.0144 1.0066 1.0693 1.0023 0.9930 0.9883 0.9859 0.9913 1.0003 1.0128 0.9850 0.9828 0.9950 0.9989 0.9868 0.9925 0.9951 0.9935 0.9940
dispcorr: -0.028319741 hartree
energy: -1781.781626260650
dipole: 7.48184 -6.49113 0.99071 18.19841 -14.46850 3.72991 -7.92471 7.39131 -0.53340
magnitude: 3.89593 au
magnitude: 9.90267 debye
