program: Orca
programVersion: 4.2.1
elementType: S O O O O O O O N N N N N C C C C C C C C C C C C C C C H H H H H H H H H H H H H H H H H H H
charge: 0
multiplicity: 1
keywords: wb97x-d3
keywords: def2-TZVPP
keywords: def2/J RIJCOSX GRIDX6 NOFINALGRIDX
keywords: grid4 nofinalgrid
keywords: scfconv7
keywords: smallprint printgap noloewdin
keywords: NOSOSCF
formula: C15H19N5O7S
InChI: InChI=1S/C15H19N5O7S/c1-24-8-9-27-10-6-4-5-7-11(10)28(22,23)20-13(21)16-12-17-14(25-2)19-15(18-12)26-3/h4-7,16,20H,8-9H2,1-3H3
47 atoms
S  -2.172276 -0.376688 -1.952781
O  -1.227054 1.525972 0.054324
O  -2.956508 -1.44095 -2.546303
O  -1.639257 0.661678 -2.815444
O  1.511482 1.473594 1.221265
O  -1.957455 -2.330845 0.237756
O  4.460247 -1.333303 2.137211
O  3.212292 0.474217 -1.779585
N  -0.819557 -1.029356 -1.230728
N  0.255789 -2.042293 0.564466
N  1.763103 -0.804507 -0.69702
N  2.347051 -1.726405 1.388877
N  3.910862 -0.431379 0.189681
C  -3.111915 0.33911 -0.645398
C  -2.535192 1.303207 0.194879
C  -4.450761 -0.008688 -0.532984
C  -3.351707 1.933907 1.130702
C  -0.616862 2.593028 0.775502
C  -5.247433 0.617791 0.408702
C  -4.69123 1.589679 1.227142
C  0.875403 2.532652 0.548484
C  -0.915448 -1.83179 -0.131421
C  1.496389 -1.488612 0.397236
C  1.751243 1.73127 2.583629
C  3.531077 -1.172736 1.223527
C  2.978615 -0.262757 -0.721044
C  4.161316 -2.102305 3.302971
C  4.486077 1.105753 -1.912961
H  -4.874493 -0.762837 -1.180535
H  -2.958971 2.693613 1.790881
H  0.090047 -0.594386 -1.432066
H  -0.846881 2.521187 1.842345
H  -1.001499 3.550754 0.413545
H  -6.290859 0.35182 0.497762
H  -5.305438 2.092425 1.961996
H  1.081572 2.415784 -0.51785
H  1.294296 3.500446 0.851018
H  0.144931 -2.605739 1.397609
H  2.311417 0.890983 2.992236
H  2.346464 2.639898 2.729187
H  0.831684 1.831911 3.170179
H  3.911888 -3.131444 3.049432
H  3.346084 -1.660948 3.874813
H  5.067453 -2.088455 3.901133
H  4.445938 1.647683 -2.852951
H  5.292143 0.374834 -1.952022
H  4.669369 1.806989 -1.100173
elementType: S O N C H
totalener: -1781.75153988 hartree
nucrepener: 3144.85164161 hartree
electener: -4926.60318149 hartree
oneelecener: -8697.82193390 hartree
twoeener: 3771.21875241 hartree
cpcmener: -0.05887911 hartree
kineticenergy: 1775.30469329 hartree
xcener: -146.595062248139 hartree
chargesum: -0.0000000
charge: 0.890324 -0.295922 -0.519249 -0.527337 -0.344437 -0.473869 -0.284091 -0.287574 -0.190118 -0.122854 -0.394520 -0.419640 -0.382517 -0.171570 0.383424 -0.084428 -0.225037 0.006682 -0.207503 -0.127053 0.004104 0.362436 0.393843 -0.100467 0.412102 0.466273 -0.113098 -0.117001 0.153748 0.145155 0.205456 0.097865 0.123521 0.165884 0.168849 0.083600 0.100227 0.195829 0.091988 0.100482 0.097292 0.119986 0.113032 0.134401 0.134083 0.120680 0.117021
qa: 0.8903 -0.2959 -0.5192 -0.5273 -0.3444 -0.4739 -0.2841 -0.2876 -0.1901 -0.1229 -0.3945 -0.4196 -0.3825 -0.1716 0.3834 -0.0844 -0.2250 0.0067 -0.2075 -0.1271 0.0041 0.3624 0.3938 -0.1005 0.4121 0.4663 -0.1131 -0.1170 0.1537 0.1452 0.2055 0.0979 0.1235 0.1659 0.1688 0.0836 0.1002 0.1958 0.0920 0.1005 0.0973 0.1200 0.1130 0.1344 0.1341 0.1207 0.1170
va: 5.8096 2.1011 1.9720 1.9583 1.9545 2.0357 2.1147 2.1235 3.0704 3.2026 2.9505 2.9154 2.9142 3.7504 3.8182 3.9319 3.9105 3.8288 3.9522 3.9230 3.9418 4.4169 4.2125 3.9239 4.2809 4.1833 3.8473 3.8407 1.0140 1.0059 1.0811 0.9876 0.9972 0.9885 0.9854 1.0113 1.0036 1.0150 0.9941 0.9947 0.9838 0.9948 0.9920 0.9942 0.9937 0.9967 0.9955
dispcorr: -0.027900437 hartree
energy: -1781.779440320119
dipole: 12.70369 -10.41489 2.28880 15.08304 -12.56924 2.51380 18.30924 -14.15234 4.15690
magnitude: 5.37006 au
magnitude: 13.64962 debye
