program: Gaussian 09
title: 000069119
version: EM64L-G09RevD.01
frameworkgroup: C1[X(C10H9NO6)]
method: RPBEPBE
basis: SDD
operation: Freq
keyword: #p
keyword: freq=noraman
keyword: PBEPBE/SDD
title: #p freq=noraman PBEPBE/SDD
converged: YES YES NO NO
title: Mulliken charges:
elementType: O O O O O O N C C C C C C C C C C H H H H H H H H H
charge: -0.261087 -0.277573 -0.221815 -0.228232 -0.196933 -0.190181 0.024146 0.262365 0.160344 -0.513600 0.414950 -0.300793 -0.366249 0.149381 0.178317 -0.501295 -0.497469 0.317573 0.281597 0.294688 0.249481 0.233320 0.254909 0.238968 0.247588 0.247602
chargesum: 0.00000
title: Mulliken charges with hydrogens summed into heavy atoms:
elementType: O O O O O O N C C C C C C C C C C
charge: -0.261087 -0.277573 -0.221815 -0.228232 -0.196933 -0.190181 0.024146 0.262365 0.160344 -0.196027 0.414950 -0.019197 -0.071561 0.149381 0.178317 0.236414 0.236690
polarizability: 2.02232283e+02 4.98699717e-01 1.55970308e+02 -2.10990207e-01 9.17837274e+00 7.27869776e+01
1716.lowfreq: -8.2426 -7.9208 -6.1757 0.0008 0.0009 0.0009 23.8298 47.5767 58.3357
frequency: 23.7100 47.5750 58.3220 65.7430 76.0976 87.3415 95.1303 110.3042 133.1506 156.9943 201.2325 224.8109 251.1123 272.3312 291.8026 295.8985 325.1248 353.0251 427.2627 474.9784 500.1733 532.2113 567.5185 650.4562 659.7159 686.2693 699.0925 725.2740 755.7190 763.5433 784.6475 836.8903 873.7975 913.9979 937.2294 957.8770 1004.2290 1043.9516 1088.9792 1093.1621 1113.7577 1114.9256 1135.8239 1150.7220 1153.4418 1210.7176 1227.9553 1253.1522 1264.2357 1371.8300 1390.7484 1411.5060 1421.8543 1424.6177 1451.8056 1452.2963 1462.4856 1464.6069 1471.6784 1584.7490 1605.4183 1627.3561 1633.0375 3007.6881 3008.3616 3111.9905 3113.5997 3153.8795 3155.9834 3177.2835 3182.9310 3194.2147
redmass: 6.3468 11.0910 5.4547 1.8474 3.5924 1.3374 1.4123 4.7581 5.7753 4.7189 6.1357 6.1282 7.2877 5.1488 5.0630 8.6573 5.3656 7.3557 3.8769 6.9969 8.8706 5.6310 5.8910 7.1546 7.5378 7.7227 4.8865 9.0939 7.8139 6.1228 4.6734 7.0644 1.5164 7.0934 5.2907 1.6800 1.3688 5.5320 2.3186 3.8907 1.3551 1.2677 1.5104 1.4788 1.4925 8.7742 4.2843 3.8536 1.3968 8.1545 7.8930 2.5323 1.3770 1.3451 1.0506 1.0501 1.0514 1.0530 2.9025 8.5927 7.4837 9.9318 10.6188 1.0291 1.0295 1.1048 1.1050 1.1050 1.1051 1.0891 1.0928 1.0972
irintensity: 0.5322 0.0558 0.1366 1.0802 2.5591 0.1582 1.6963 0.5999 1.4860 10.7743 8.0767 2.1595 3.3877 6.9448 13.4524 2.8924 8.7800 9.3388 1.5861 4.5172 2.8557 4.4561 3.1308 1.0811 1.3652 9.1886 49.6511 8.6596 28.5350 17.0399 2.7766 9.5327 28.4564 12.3905 11.2900 18.1130 1.3526 115.6662 96.1997 178.6833 6.0174 1.5214 5.6357 41.3975 37.3361 397.4528 134.2271 159.8084 20.5178 106.5368 6.2063 47.9265 31.7777 5.2032 4.3431 26.3709 16.0956 8.8497 19.9586 4.6908 44.0249 208.6941 90.0011 25.8177 33.3093 21.6596 16.0964 13.1698 13.3871 1.8402 7.0489 0.9627
temp: 298.150 k
press: 1.00000 atm
elementType: 8 8 8 8 8 8 7 6 6 6 6 6 6 6 6 6 6 1 1 1 1 1 1 1 1 1
symmnumber: 1
zpe: 475822.7 jmol-1
zpe.correction: 0.181231 hartree
zpe.thermalcorrener: 0.197972 hartree
zpe.thermalcorrenthalpy: 0.198916 hartree
zpe.thermalcorrgfe: 0.134527 hartree
zpe.sumelectzpe: -891.229540 hartree
zpe.sumelectthermal: -891.212799 hartree
zpe.sumelectthermalent: -891.211855 hartree
zpe.sumelectthermalfe: -891.276244 hartree
dipole: 5.6823 -3.1211 -1.9521
dipole: 6.7706
quadrupole: -105.4833 -87.6745 -100.3749
quadrupole: -1.1296 -5.0369 -7.0767
quadrupole: -7.6390 10.1697 -2.5307 -1.1296 -5.0369 -7.0767
hfenergy: -891.4107711 hartree
pointgroup: C01 [X(C10H9N1O6)]
dipole: -2.2106295 1.1370033 -0.9570357 debye
dipolederiv: -0.8833905 -0.378848 -0.4103427 -0.3322431 -0.6595732 -0.0886932 -0.5528595 -0.2830133 -0.7516031 -0.9564088 0.4353115 -0.1162852 0.6205416 -0.9719515 0.3000766 -0.2918849 0.3589168 -0.4451732 -0.4674965 -0.1611371 -0.1099634 -0.0236337 -0.7536737 0.3323171 -0.2316106 0.0473335 -0.6494029 -0.7925257 -0.1326343 0.2015011 0.0623909 -0.6814241 0.1877291 0.0248261 0.2339254 -0.4593647 -0.7981547 -0.2112737 0.001312 -0.1619767 -0.6062029 0.0323631 -0.0003209 0.0330073 -0.2240001 -0.6958528 0.1670483 -0.0339548 0.1647884 -0.6657704 0.0474638 -0.0307594 0.0495562 -0.2192161 1.8182249 -0.0142107 0.0506315 -0.0783779 1.0583548 -0.0899103 0.0648185 -0.08294 0.1977766 -0.1663134 0.0217872 -0.042016 -0.0941193 -0.114394 0.0272577 0.0621975 0.0582821 -0.035477 -0.3050367 0.0775012 -0.006722 0.1383551 0.086686 0.0381324 -0.0392217 -0.0559011 0.0028593 0.03507 -0.1383548 0.0153357 0.0629348 -0.1137667 -0.0009497 0.0271393 0.0049497 -0.083573 -0.5675608 0.0553662 -0.0164874 0.1400353 0.0866397 0.0056138 -0.0425233 -0.0036712 0.0781419 -0.2359984 -0.2027802 0.0193876 -0.0816557 0.0092608 -0.0157003 -0.0452508 -0.03304 -0.0875132 0.1119171 0.1646426 -0.0131424 -0.1847192 -0.0880086 -0.0161436 0.0126125 -0.0001838 -0.0995201 1.0028829 0.5088395 0.5260558 0.3110149 1.100378 -0.3118201 0.6780801 0.1384453 1.0951264 1.48262 -0.2298297 -0.1110913 -0.600507 1.2601937 -0.5226705 0.1857261 -0.5570095 0.5891595 0.4455198 0.1868565 0.0680324 0.2544851 0.4387296 0.1301571 0.085668 0.092359 0.2648928 0.6200263 -0.2679123 0.0746084 -0.184901 0.3510073 -0.0129746 0.0646259 -0.011924 0.263894 0.1447658 0.0311073 0.0030265 0.0106242 0.0916359 0.0061485 -0.0193736 -0.0032213 0.1633429 0.1003128 0.0331054 -0.0007431 0.0423696 0.0093705 0.0099307 0.0290717 0.0191779 0.1470392 0.0971972 -0.0518382 0.0080857 -0.027386 0.0851438 0.0087632 0.0040704 0.0045679 0.1700996 0.0076784 0.0826535 -0.0145332 -0.007227 -0.081053 -0.0317726 -0.0034224 0.0384548 0.1123964 0.0360573 -0.045773 -0.0808388 -0.0111356 0.0936174 0.0278634 -0.1070278 -0.018579 -0.0603094 -0.0322991 -0.0357954 0.0446266 -0.0233919 0.0489699 -0.0722852 0.1132361 -0.0128348 -0.0075864 0.0645143 0.0101716 0.0038871 0.0692658 -0.0555498 0.0939024 -0.0254375 0.1009617 0.0678336 -0.0229584 0.0748006 -0.0060514 0.0189262 0.0869575 0.0020551 0.0703853 -0.056022 -0.0893639 -0.0427911 0.021196 -0.0543186 -0.0844576 -0.0155771 -0.0868539 -0.0327651 -0.0615974 0.0595408 unknown
polarizability: 201.5148575|2.6583206|155.3655613|9.1259134|-11.6638214|74.10915 unknown
InChI: InChI=1S/C10H9NO6/c1-16-9(12)7-4-3-6(11(14)15)5-8(7)10(13)17-2/h3-5H,1-2H3
charge 0 multiplicity 1
26 atoms
O  -1.69624 -1.887912 -0.89292
O  -2.356368 2.112862 -0.549432
O  -0.645724 -2.779113 0.993113
O  -2.785804 0.200551 0.709912
O  4.496982 1.2089 0.058823
O  4.201267 -1.041358 0.290859
N  3.75283 0.158732 0.14848
C  0.043756 -0.60733 0.112985
C  -0.501568 0.70269 -0.02044
C  1.442165 -0.77962 0.188179
C  2.277675 0.348571 0.081559
C  0.368826 1.817052 -0.133637
C  1.764686 1.650744 -0.091661
C  -0.797572 -1.854299 0.164448
C  -1.980557 0.931859 0.088861
C  -2.649943 -3.024498 -0.889979
C  -3.796228 2.459172 -0.451154
H  1.877173 -1.773755 0.320188
H  -0.066495 2.813259 -0.24184
H  2.451697 2.496198 -0.176476
H  -2.11081 -3.977835 -0.763716
H  -3.152339 -2.973101 -1.865483
H  -3.368075 -2.889897 -0.064046
H  -3.893796 3.405891 -0.999506
H  -4.08792 2.574692 0.606079
H  -4.406718 1.665543 -0.912696
