program: Orca
programVersion: 4.2.1
elementType: S O O O O O O O N N N N N C C C C C C C C C C C C C C C H H H H H H H H H H H H H H H H H H H
charge: 0
multiplicity: 1
keywords: wb97x-d3
keywords: def2-TZVPP
keywords: def2/J RIJCOSX GRIDX6 NOFINALGRIDX
keywords: grid4 nofinalgrid
keywords: scfconv7
keywords: smallprint printgap noloewdin
keywords: NOSOSCF
formula: C15H19N5O7S
InChI: InChI=1S/C15H19N5O7S/c1-24-8-9-27-10-6-4-5-7-11(10)28(22,23)20-13(21)16-12-17-14(25-2)19-15(18-12)26-3/h4-7,16,20H,8-9H2,1-3H3
47 atoms
S  -2.041851 -0.702659 -1.815292
O  -1.00812 1.685875 -0.521222
O  -2.861713 -1.873922 -2.043784
O  -1.496106 0.017212 -2.950558
O  0.59101 1.137342 1.828952
O  -1.761264 -2.110433 0.806062
O  4.835392 -1.111254 1.988781
O  3.297896 0.471956 -1.859485
N  -0.691702 -1.138865 -0.948671
N  0.484023 -1.876072 0.908172
N  1.857371 -0.709214 -0.557913
N  2.6583 -1.537873 1.48757
N  4.084713 -0.303679 0.06783
C  -2.937821 0.403506 -0.778235
C  -2.313446 1.552242 -0.271103
C  -4.285761 0.156727 -0.558915
C  -3.088264 2.458813 0.448034
C  -0.230419 2.65366 0.174628
C  -5.04147 1.062774 0.163769
C  -4.436698 2.210778 0.653369
C  -0.062072 2.364706 1.646922
C  -0.741882 -1.728198 0.280122
C  1.703603 -1.354351 0.588904
C  0.670438 0.786584 3.187583
C  3.820243 -0.991822 1.168257
C  3.063744 -0.199763 -0.758697
C  4.660198 -1.828345 3.209786
C  2.247821 0.621868 -2.815949
H  -4.746547 -0.739407 -0.950287
H  -2.658678 3.367317 0.84594
H  0.210207 -0.741974 -1.244617
H  -0.641828 3.658519 0.044579
H  0.739269 2.639567 -0.322522
H  -6.091333 0.874514 0.338702
H  -5.019745 2.931417 1.21154
H  0.520248 3.197348 2.068736
H  -1.02892 2.37175 2.168393
H  0.435147 -2.341562 1.805545
H  1.234964 -0.14139 3.271305
H  1.187925 1.550152 3.782157
H  -0.320729 0.628508 3.63055
H  5.628914 -1.807325 3.701306
H  4.368784 -2.862768 3.03073
H  3.921003 -1.350267 3.852358
H  1.402593 1.173401 -2.403316
H  1.910622 -0.34236 -3.195937
H  2.676464 1.195284 -3.633007
elementType: S O N C H
totalener: -1781.75119515 hartree
nucrepener: 3175.42194092 hartree
electener: -4957.17313608 hartree
oneelecener: -8757.74887977 hartree
twoeener: 3800.57574369 hartree
cpcmener: -0.04877141 hartree
kineticenergy: 1775.31273768 hartree
xcener: -146.597048844896 hartree
chargesum: 0.0000000
charge: 0.874791 -0.316297 -0.502041 -0.511277 -0.329468 -0.443294 -0.271090 -0.270284 -0.190416 -0.125977 -0.406029 -0.427590 -0.353010 -0.147031 0.359362 -0.086699 -0.231014 0.002219 -0.198038 -0.127349 -0.011936 0.344846 0.360117 -0.112203 0.457622 0.425489 -0.119276 -0.119765 0.152114 0.145926 0.209476 0.121625 0.107839 0.162107 0.163932 0.097884 0.094514 0.194279 0.086686 0.106509 0.105177 0.133500 0.117601 0.115970 0.098146 0.123871 0.138482
qa: 0.8748 -0.3163 -0.5020 -0.5113 -0.3295 -0.4433 -0.2711 -0.2703 -0.1904 -0.1260 -0.4060 -0.4276 -0.3530 -0.1470 0.3594 -0.0867 -0.2310 0.0022 -0.1980 -0.1273 -0.0119 0.3448 0.3601 -0.1122 0.4576 0.4255 -0.1193 -0.1198 0.1521 0.1459 0.2095 0.1216 0.1078 0.1621 0.1639 0.0979 0.0945 0.1943 0.0867 0.1065 0.1052 0.1335 0.1176 0.1160 0.0981 0.1239 0.1385
va: 5.8400 2.0816 1.9954 1.9756 1.9365 2.0740 2.1305 2.1343 3.0770 3.1935 2.9414 2.9257 2.9607 3.7833 3.7898 3.9464 3.8963 3.9015 3.9501 3.9246 3.9019 4.4418 4.2591 3.8918 4.2433 4.2602 3.8575 3.8550 1.0147 1.0037 1.0735 1.0006 0.9954 0.9896 0.9870 0.9997 0.9884 1.0131 1.0023 0.9918 0.9926 0.9942 0.9951 0.9901 0.9921 0.9923 0.9981
dispcorr: -0.029656107 hartree
energy: -1781.780851261329
dipole: 3.72798 -3.00936 0.71862 13.16437 -10.77492 2.38945 16.66927 -13.47695 3.19232
magnitude: 4.05176 au
magnitude: 10.29877 debye
