program: Gaussian 09
title: 000074145
version: EM64L-G09RevD.01
frameworkgroup: C1[X(C14H6N2O6)]
method: RPBEPBE
basis: SDD
operation: Freq
keyword: #p
keyword: freq=noraman
keyword: PBEPBE/SDD
title: #p freq=noraman PBEPBE/SDD
converged: YES YES YES YES
title: Mulliken charges:
elementType: O O O O O O N N C C C C C C C C C C C C C C H H H H H H
charge: -0.164684 -0.164684 -0.188058 -0.188061 -0.180567 -0.180567 0.025347 0.025348 0.290793 0.290795 0.276982 0.276975 -0.193613 -0.193614 -0.496891 -0.496884 -0.343475 -0.343474 0.407137 0.407132 -0.377339 -0.377335 0.340425 0.340426 0.301931 0.301931 0.302010 0.302012
chargesum: 0.00000
title: Mulliken charges with hydrogens summed into heavy atoms:
elementType: O O O O O O N N C C C C C C C C C C C C C C
charge: -0.164684 -0.164684 -0.188058 -0.188061 -0.180567 -0.180567 0.025347 0.025348 0.290793 0.290795 0.276982 0.276975 -0.193613 -0.193614 -0.156466 -0.156458 -0.041544 -0.041543 0.407137 0.407132 -0.075329 -0.075323
polarizability: 3.39555641e+02 -4.93363087e+00 2.12977743e+02 -1.76633630e-03 8.05283106e-03 6.65478014e+01
1716.lowfreq: -0.0012 -0.0008 0.0010 2.7319 6.1699 11.3163 28.6176 44.1909 49.8513
frequency: 28.6176 44.1909 49.8392 84.2668 86.1723 103.4407 142.4975 157.0896 161.5746 227.3463 239.8390 267.3871 285.8485 302.1382 321.7608 406.2130 412.7563 426.6725 447.1326 448.6402 461.3697 496.4324 504.4725 512.8719 548.5802 632.2102 638.7588 654.6817 677.3493 686.8669 686.9979 711.4162 726.3519 738.9679 767.7297 777.0811 847.8625 857.3059 890.7534 917.3157 955.2739 959.6024 982.7035 988.7527 1020.3960 1020.9929 1057.1461 1070.1156 1109.8167 1113.1300 1156.0831 1172.7529 1206.1063 1209.2097 1220.8816 1248.6463 1266.4011 1298.3540 1375.1535 1378.8898 1399.8775 1415.4401 1416.7468 1433.6492 1462.2125 1464.3140 1546.7702 1556.8357 1577.1006 1601.5270 1606.9715 1621.2951 3166.3578 3166.5567 3178.5493 3178.7692 3188.2844 3188.4509
redmass: 13.9842 14.1355 15.0076 7.6662 9.4710 12.4197 5.6742 12.3598 5.9128 8.0153 12.5996 8.3399 6.4512 9.7615 13.9436 7.4334 3.3238 9.6723 7.6264 3.2746 12.1142 8.8827 8.5333 5.2612 7.3462 6.0199 7.6440 6.9908 7.7368 7.7950 5.2591 4.7594 4.2021 10.5581 7.3726 10.9848 7.9865 1.7700 1.4449 2.4322 6.2702 4.8702 1.4778 1.6676 1.3826 1.3739 2.1634 1.9067 2.7593 1.7072 1.6223 4.2745 10.1922 3.0124 2.9596 1.4093 1.9534 5.3329 9.1481 11.6501 7.2562 9.0974 6.4699 6.4693 2.9499 2.7908 11.6810 10.0435 8.8712 7.6372 8.6228 8.0385 1.0904 1.0904 1.0925 1.0924 1.0962 1.0962
irintensity: 0.2250 0.2549 0.0000 14.1724 0.0000 3.0811 2.3649 0.0000 0.0000 1.5089 0.0000 2.9544 0.0000 0.0000 7.0132 0.0000 1.8256 36.4663 0.0000 0.0000 0.0000 0.0000 3.6423 0.8563 0.0000 0.0000 2.8253 24.7739 0.0000 0.0011 53.1196 0.0000 13.8526 64.3879 5.9504 0.0000 3.6168 0.0000 54.3509 0.0000 0.0000 82.7556 41.3811 0.0000 0.0000 0.3525 68.1626 0.0000 28.6941 0.0000 37.2405 0.0000 726.2869 0.0084 0.0003 13.2530 0.0000 442.7388 234.0841 0.0068 2.5134 0.0000 25.0665 0.0000 18.3334 0.0000 0.0000 234.0297 4.7933 0.0000 0.0000 16.9022 6.5818 0.0011 24.0129 0.0007 3.8627 0.0027
temp: 298.150 k
press: 1.00000 atm
elementType: 8 8 8 8 8 8 7 7 6 6 6 6 6 6 6 6 6 6 6 6 6 6 1 1 1 1 1 1
symmnumber: 1
zpe: 468690.4 jmol-1
zpe.correction: 0.178515 hartree
zpe.thermalcorrener: 0.195361 hartree
zpe.thermalcorrenthalpy: 0.196305 hartree
zpe.thermalcorrgfe: 0.132337 hartree
zpe.sumelectzpe: -1096.285580 hartree
zpe.sumelectthermal: -1096.268734 hartree
zpe.sumelectthermalent: -1096.267790 hartree
zpe.sumelectthermalfe: -1096.331758 hartree
dipole: 0.0001 0.0000 0.0000
dipole: 0.0001
quadrupole: -174.8504 -130.6544 -121.2768
quadrupole: -19.4917 -0.0030 -0.0004
quadrupole: -32.5899 11.6062 20.9837 -19.4917 -0.0030 -0.0004
hfenergy: -1096.4640948 hartree
pointgroup: C01 [X(C14H6N2O6)]
dipole: 0.0000351 0.0000151 -0.000002 debye
polarizability: 339.6077814|-4.2116758|212.9256031|-0.0018122|0.0080426|66.5478014 unknown
InChI: InChI=1S/C14H6N2O6/c17-13-9-3-1-7(15(19)20)5-11(9)14(18)10-4-2-8(16(21)22)6-12(10)13/h1-6H
charge 0 multiplicity 1
28 atoms
O  -0.608983 -2.690227 -0.0001
O  0.608961 2.690254 0.000129
O  -6.096957 0.625553 0.000053
O  6.096908 -0.625565 -0.000026
O  -5.430445 -1.557119 -0.00022
O  5.43039 1.557148 -0.000016
N  -5.191116 -0.291803 0.0000
N  5.191078 0.291819 -0.000179
C  -1.405794 -0.412257 0.000025
C  1.40577 0.412284 0.000017
C  -1.091597 0.979116 0.000092
C  1.091574 -0.97909 -0.000043
C  -0.329972 -1.453134 -0.000017
C  0.329949 1.453161 0.00014
C  -2.756223 -0.831031 -0.000008
C  2.7562 0.831059 -0.000029
C  -2.133669 1.939591 0.000127
C  2.133645 -1.939568 -0.000133
C  -3.764178 0.146791 0.000032
C  3.764142 -0.146772 -0.000125
C  -3.478687 1.532345 0.000099
C  3.478664 -1.532326 -0.000171
H  -3.000771 -1.896867 -0.000064
H  3.000754 1.896894 0.000015
H  -1.861629 2.999171 0.000181
H  1.861603 -2.999148 -0.000173
H  -4.303046 2.249856 0.000132
H  4.303028 -2.249833 -0.000238
