program: Orca
programVersion: 4.2.1
elementType: S O O O O O O O N N N N N C C C C C C C C C C C C C C C H H H H H H H H H H H H H H H H H H H
charge: 0
multiplicity: 1
keywords: wb97x-d3
keywords: def2-TZVPP
keywords: def2/J RIJCOSX GRIDX6 NOFINALGRIDX
keywords: grid4 nofinalgrid
keywords: scfconv7
keywords: smallprint printgap noloewdin
keywords: NOSOSCF
formula: C15H19N5O7S
InChI: InChI=1S/C15H19N5O7S/c1-24-8-9-27-10-6-4-5-7-11(10)28(22,23)20-13(21)16-12-17-14(25-2)19-15(18-12)26-3/h4-7,16,20H,8-9H2,1-3H3
47 atoms
S  -2.234249 -1.612342 0.17776
O  -1.632354 0.801145 -1.320435
O  -2.794899 -2.495587 1.178024
O  -2.058548 -2.097041 -1.177413
O  0.809445 2.341801 -0.511797
O  -1.235809 -0.327452 2.675913
O  2.8279 -1.484123 -1.969567
O  5.308964 0.383464 1.280201
N  -0.696516 -1.167977 0.635657
N  0.915589 -0.205283 2.002138
N  3.142485 0.100773 1.645071
N  1.816297 -0.881545 -0.02824
N  4.112656 -0.570214 -0.401687
C  -3.157347 -0.113508 0.188229
C  -2.752957 0.964717 -0.612104
C  -4.303069 -0.04788 0.968164
C  -3.537566 2.116217 -0.604716
C  -1.066414 1.89971 -2.027375
C  -5.077605 1.098108 0.957277
C  -4.686949 2.169728 0.168484
C  -0.338704 2.873961 -1.122095
C  -0.411595 -0.558226 1.821601
C  1.991228 -0.338007 1.173405
C  1.932188 2.302841 -1.355995
C  2.906568 -0.971384 -0.767311
C  4.164946 -0.048119 0.810993
C  1.561989 -1.955164 -2.436153
C  6.471499 0.289869 0.456819
H  -4.58979 -0.888648 1.583942
H  -3.271588 2.979057 -1.198329
H  0.053978 -1.233041 -0.062574
H  -1.82535 2.427936 -2.610834
H  -0.385069 1.448148 -2.749133
H  -5.971934 1.153753 1.561621
H  -5.281698 3.073455 0.152468
H  -0.094602 3.759661 -1.725059
H  -0.992885 3.215737 -0.315909
H  1.111773 0.230998 2.894158
H  2.108312 3.267587 -1.84718
H  2.807552 2.087417 -0.744147
H  1.863239 1.541184 -2.140978
H  0.827342 -1.15109 -2.489815
H  1.181588 -2.763247 -1.811478
H  1.742367 -2.33502 -3.437626
H  6.703183 -0.744959 0.207053
H  7.281227 0.708149 1.04814
H  6.358683 0.867033 -0.46052
elementType: S O N C H
totalener: -1781.75051503 hartree
nucrepener: 3142.99995297 hartree
electener: -4924.75046800 hartree
oneelecener: -8693.06122509 hartree
twoeener: 3768.31075709 hartree
cpcmener: -0.04875524 hartree
kineticenergy: 1775.30619917 hartree
xcener: -146.595582589848 hartree
chargesum: 0.0000000
charge: 0.875124 -0.304082 -0.501799 -0.511075 -0.361323 -0.444837 -0.268766 -0.271843 -0.194281 -0.114962 -0.378307 -0.399397 -0.376849 -0.149009 0.345200 -0.079072 -0.227467 -0.019375 -0.199827 -0.126541 0.021966 0.347803 0.362653 -0.133475 0.385636 0.448448 -0.117913 -0.115563 0.150860 0.144098 0.209570 0.116564 0.115805 0.162040 0.163662 0.092514 0.111402 0.192147 0.117628 0.111759 0.091534 0.098708 0.124438 0.139361 0.117721 0.132498 0.116628
qa: 0.8751 -0.3041 -0.5018 -0.5111 -0.3613 -0.4448 -0.2688 -0.2718 -0.1943 -0.1150 -0.3783 -0.3994 -0.3768 -0.1490 0.3452 -0.0791 -0.2275 -0.0194 -0.1998 -0.1265 0.0220 0.3478 0.3627 -0.1335 0.3856 0.4484 -0.1179 -0.1156 0.1509 0.1441 0.2096 0.1166 0.1158 0.1620 0.1637 0.0925 0.1114 0.1921 0.1176 0.1118 0.0915 0.0987 0.1244 0.1394 0.1177 0.1325 0.1166
va: 5.8421 2.0811 1.9978 1.9774 1.9176 2.0763 2.1365 2.1369 3.0780 3.2043 2.9592 2.9136 2.9044 3.7755 3.8266 3.9403 3.8860 3.8570 3.9481 3.9217 3.8793 4.4354 4.2314 3.9208 4.2814 4.2306 3.8549 3.8448 1.0153 1.0037 1.0681 1.0062 0.9902 0.9895 0.9870 1.0061 1.0008 1.0176 0.9961 0.9908 0.9790 0.9899 0.9940 0.9984 0.9960 0.9941 0.9957
dispcorr: -0.029029990 hartree
energy: -1781.779545017620
dipole: 8.64109 -7.05623 1.58486 16.62072 -13.53393 3.08679 -14.08983 11.64461 -2.44522
magnitude: 4.24490 au
magnitude: 10.78968 debye
