program: Orca
programVersion: 4.2.1
elementType: S O O O O O O O N N N N N C C C C C C C C C C C C C C C H H H H H H H H H H H H H H H H H H H
charge: 0
multiplicity: 1
keywords: wb97x-d3
keywords: def2-TZVPP
keywords: def2/J RIJCOSX GRIDX6 NOFINALGRIDX
keywords: grid4 nofinalgrid
keywords: scfconv7
keywords: smallprint printgap noloewdin
keywords: NOSOSCF
formula: C15H19N5O7S
InChI: InChI=1S/C15H19N5O7S/c1-24-8-9-27-10-6-4-5-7-11(10)28(22,23)20-13(21)16-12-17-14(25-2)19-15(18-12)26-3/h4-7,16,20H,8-9H2,1-3H3
47 atoms
S  -1.978017 -0.864189 1.047858
O  -0.919971 1.759639 0.413293
O  -1.507023 -0.350332 2.317906
O  -2.817329 -2.045016 1.035793
O  -2.292375 3.5134 2.341439
O  -1.617451 -1.81266 -1.717783
O  5.12266 -2.025678 -2.360809
O  3.526652 -0.828792 1.660921
N  -0.574875 -1.181178 0.195022
N  0.635233 -1.789597 -1.700755
N  2.08109 -1.27191 0.040537
N  2.869294 -1.916388 -2.082094
N  4.395697 -1.434507 -0.352255
C  -2.783869 0.391678 0.113648
C  -2.169192 1.638779 -0.048323
C  -4.041082 0.127668 -0.415244
C  -2.856642 2.624645 -0.752633
C  -0.418047 3.016334 0.854946
C  -4.715946 1.119518 -1.10084
C  -4.115793 2.361873 -1.263405
C  -0.901811 3.340212 2.252617
C  -0.597455 -1.609902 -1.098724
C  1.901302 -1.647608 -1.212234
C  -2.740379 4.78888 1.956692
C  4.087062 -1.78928 -1.594901
C  3.356646 -1.188656 0.414188
C  4.903818 -2.409757 -3.718328
C  4.856656 -0.730298 2.171405
H  -4.492542 -0.846023 -0.289205
H  -2.413527 3.595284 -0.924158
H  0.32761 -0.997507 0.646912
H  -0.637187 3.813613 0.140019
H  0.665914 2.904424 0.877201
H  -5.696216 0.92311 -1.511681
H  -4.631286 3.141894 -1.808221
H  -0.639077 2.515599 2.918518
H  -0.357393 4.228408 2.602128
H  0.579611 -2.092083 -2.664949
H  -2.357247 5.572719 2.621099
H  -2.463807 5.058802 0.9315
H  -3.82845 4.791117 2.016476
H  4.345035 -3.342567 -3.784922
H  5.893332 -2.551319 -4.143922
H  4.379837 -1.632514 -4.273696
H  5.374739 -1.687293 2.12039
H  4.747972 -0.434003 3.210886
H  5.434947 0.023541 1.638306
elementType: S O N C H
totalener: -1781.75132648 hartree
nucrepener: 3010.38677876 hartree
electener: -4792.13810523 hartree
oneelecener: -8429.14202339 hartree
twoeener: 3637.00391816 hartree
cpcmener: -0.05136785 hartree
kineticenergy: 1775.31034163 hartree
xcener: -146.593200012560 hartree
chargesum: -0.0000000
charge: 0.880983 -0.321876 -0.509842 -0.503847 -0.376570 -0.452456 -0.274001 -0.279515 -0.190782 -0.136267 -0.405719 -0.433412 -0.394815 -0.111500 0.303482 -0.086026 -0.208804 -0.037820 -0.186136 -0.129789 0.053438 0.366612 0.403562 -0.113376 0.438910 0.459758 -0.117944 -0.114935 0.149167 0.153782 0.206572 0.109282 0.110822 0.162249 0.161595 0.093961 0.094063 0.193496 0.105545 0.083272 0.118081 0.117682 0.132929 0.117901 0.117757 0.133033 0.117499
qa: 0.8810 -0.3219 -0.5098 -0.5038 -0.3766 -0.4525 -0.2740 -0.2795 -0.1908 -0.1363 -0.4057 -0.4334 -0.3948 -0.1115 0.3035 -0.0860 -0.2088 -0.0378 -0.1861 -0.1298 0.0534 0.3666 0.4036 -0.1134 0.4389 0.4598 -0.1179 -0.1149 0.1492 0.1538 0.2066 0.1093 0.1108 0.1622 0.1616 0.0940 0.0941 0.1935 0.1055 0.0833 0.1181 0.1177 0.1329 0.1179 0.1178 0.1330 0.1175
va: 5.8267 2.0566 1.9796 1.9940 1.9130 2.0669 2.1326 2.1369 3.0728 3.1986 2.9565 2.9501 2.9401 3.7739 3.8225 3.9375 3.8641 3.9041 3.9333 3.9210 3.8747 4.4193 4.2098 3.9044 4.2793 4.1861 3.8466 3.8418 1.0181 0.9929 1.0702 0.9874 1.0087 0.9890 0.9883 1.0068 1.0061 1.0168 0.9943 0.9841 0.9907 0.9953 0.9939 0.9951 0.9966 0.9929 0.9962
dispcorr: -0.024068054 hartree
energy: -1781.775394531395
dipole: 4.52127 -1.52761 2.99366 22.34528 -19.43870 2.90659 0.43493 -2.46767 -2.03274
magnitude: 4.64137 au
magnitude: 11.79742 debye
