program: Gaussian 09
title: 000074114
version: EM64L-G09RevD.01
frameworkgroup: C1[X(C4H4Cl2O2)]
method: RPBEPBE
basis: SDD
operation: Freq
keyword: #p
keyword: freq=noraman
keyword: PBEPBE/SDD
title: #p freq=noraman PBEPBE/SDD
converged: NO NO NO NO
title: Mulliken charges:
elementType: Cl Cl O O C C C C H H H H
charge: 0.077747 0.047921 -0.192500 -0.153286 -0.382251 -0.490174 -0.290832 0.334402 0.266719 0.283354 0.249507 0.249393
chargesum: 0.00000
title: Mulliken charges with hydrogens summed into heavy atoms:
elementType: Cl Cl O O C C C C
charge: 0.077747 0.047921 -0.192500 -0.153286 0.167822 -0.490174 0.208069 0.334402
polarizability: 6.95828316e+01 7.66906690e+00 6.44490072e+01 2.79652796e+00 -1.41854093e+00 5.88768211e+01
1716.lowfreq: -10.2425 -0.0039 -0.0036 -0.0023 6.7493 14.2868 100.3188 163.1513 200.3388
frequency: 100.3153 163.1461 200.3384 207.6445 258.2362 320.0153 389.3728 502.7619 549.0453 638.7864 662.1410 723.8460 835.3873 890.5036 916.5086 988.5838 1035.3678 1079.7683 1120.2379 1172.3212 1206.1754 1306.1780 1337.4264 1448.7716 1474.9334 1725.6117 3038.9208 3048.2129 3122.7470 3138.1605
redmass: 7.3357 13.2182 3.1634 11.7667 11.2980 2.8032 9.9317 7.8528 5.9042 5.2782 5.9058 5.8602 2.1884 4.4037 3.5960 3.2748 5.0661 1.8630 5.1930 1.1488 1.3080 1.3433 1.3289 1.0878 1.0848 12.9769 1.0638 1.0607 1.1020 1.1084
irintensity: 0.4539 5.6671 3.2659 1.0901 3.0373 0.5694 3.5354 15.1372 43.5907 6.9320 22.3823 28.8023 33.9765 78.2033 61.7283 23.0987 72.3071 20.0115 67.1506 13.8690 5.0855 15.6462 0.8766 17.7827 7.7518 258.1669 2.5140 25.9941 3.5903 10.8161
temp: 298.150 k
press: 1.00000 atm
elementType: 17 17 8 8 6 6 6 6 1 1 1 1
symmnumber: 1
zpe: 200981.4 jmol-1
zpe.correction: 0.076550 hartree
zpe.thermalcorrener: 0.084186 hartree
zpe.thermalcorrenthalpy: 0.085131 hartree
zpe.thermalcorrgfe: 0.043520 hartree
zpe.sumelectzpe: -1224.767192 hartree
zpe.sumelectthermal: -1224.759556 hartree
zpe.sumelectthermalent: -1224.758611 hartree
zpe.sumelectthermalfe: -1224.800222 hartree
dipole: 1.5652 3.1716 4.0690
dipole: 5.3913
quadrupole: -60.0982 -63.7422 -58.7713
quadrupole: 4.3740 3.8105 -2.6002
quadrupole: 0.7724 -2.8716 2.0992 4.3740 3.8105 -2.6002
hfenergy: -1224.8437419 hartree
pointgroup: C01 [X(C4H4Cl2O2)]
dipole: -0.8145776 1.9060161 -0.4500943 debye
dipolederiv: -0.4565574 0.0442645 0.2641371 0.0316479 -0.0968761 -0.0268226 0.2136125 -0.0444938 -0.3379538 -0.2000235 -0.0278045 -0.1023645 -0.0290531 -0.186364 -0.1266725 -0.048347 -0.0825298 -0.637399 -1.0405021 0.5316535 -0.0439629 0.1627327 -0.7144135 0.0250027 -0.0130046 0.0395001 -0.2537754 -0.5327516 0.1654282 -0.0150675 0.2040579 -1.0102565 0.0088643 -0.0076247 0.0379447 -0.2647976 -0.1973885 0.0046648 0.0328226 0.040501 -0.1150062 0.0556653 -0.0033786 0.0316417 -0.1058186 0.643416 -0.1329413 -0.2029245 -0.2387978 0.1014378 0.1202438 -0.1773513 0.1376978 1.1796415 0.2793267 -0.0170482 0.0347708 -0.1970717 0.5451177 0.0101651 0.0011599 -0.0123822 0.3144953 1.3090707 -0.5583179 0.1072145 -0.0474688 1.368974 -0.017485 0.0453479 -0.0294978 0.0856632 0.0555829 -0.0008125 -0.0130163 0.0235143 0.1191657 -0.0125347 0.0105276 -0.0090141 -0.0618267 0.0931109 -0.0479982 -0.0048825 -0.0333584 -0.0374935 -0.0224643 0.0076881 -0.0435495 0.1108547 0.0851738 -0.0068412 0.0070001 0.0503573 -0.015967 -0.0263697 0.0706663 -0.0642006 -0.0723844 -0.038458 0.0457527 -0.0637268 0.0329387 0.0416816 0.0124076 -0.099296 0.0388834 0.0433007 unknown
polarizability: 70.0799745|-6.738648|59.9524769|-3.4158833|3.6155702|62.8762085 unknown
InChI: InChI=1S/C4H4Cl2O2/c5-4(6)1-2-8-3(4)7/h1-2H2
charge 0 multiplicity 1
12 atoms
Cl 2.124227 0.18308 -1.075592
Cl 1.051169 0.798003 1.719769
O  -1.591085 -0.602787 -0.007213
O  0.176164 -2.120679 0.055764
C  -0.392954 1.405347 -0.607858
C  0.589325 0.367438 -0.064853
C  -1.737678 0.891701 -0.044282
C  -0.226482 -0.957936 0.004798
H  -0.393312 1.350485 -1.710601
H  -0.149137 2.431097 -0.295549
H  -1.921435 1.234742 0.987443
H  -2.602801 1.10561 -0.687125
