program: Orca
programVersion: 4.2.1
elementType: S O O O O O O O N N N N N C C C C C C C C C C C C C C C H H H H H H H H H H H H H H H H H H H
charge: 0
multiplicity: 1
keywords: wb97x-d3
keywords: def2-TZVPP
keywords: def2/J RIJCOSX GRIDX6 NOFINALGRIDX
keywords: grid4 nofinalgrid
keywords: scfconv7
keywords: smallprint printgap noloewdin
keywords: NOSOSCF
formula: C15H19N5O7S
InChI: InChI=1S/C15H19N5O7S/c1-24-8-9-27-10-6-4-5-7-11(10)28(22,23)20-13(21)16-12-17-14(25-2)19-15(18-12)26-3/h4-7,16,20H,8-9H2,1-3H3
47 atoms
S  -2.189411 -0.33422 -1.869069
O  -1.371915 1.790511 -0.083894
O  -2.946057 -1.414372 -2.465491
O  -1.642534 0.697849 -2.724853
O  1.393447 3.950702 0.749565
O  -2.013042 -2.467509 0.158154
O  4.542775 -2.374558 1.849333
O  3.224926 0.603577 -1.239755
N  -0.853547 -0.964152 -1.085615
N  0.207637 -2.305204 0.498209
N  1.723826 -0.809832 -0.427971
N  2.364799 -2.384977 1.199613
N  3.955706 -0.887329 0.315027
C  -3.14761 0.363686 -0.566459
C  -2.609043 1.396474 0.214853
C  -4.423606 -0.126213 -0.332046
C  -3.381462 1.91897 1.247793
C  -0.721026 2.770159 0.711178
C  -5.189759 0.414138 0.686276
C  -4.660007 1.429055 1.469255
C  0.602713 3.052934 0.015124
C  -0.96573 -1.939117 -0.137364
C  1.473082 -1.803659 0.404446
C  2.13039 3.35091 1.788264
C  3.580521 -1.884584 1.109801
C  2.989123 -0.393288 -0.424885
C  4.246726 -3.444228 2.747675
C  4.55034 1.128261 -1.322027
H  -4.818213 -0.929384 -0.93828
H  -3.000339 2.705679 1.88411
H  0.056705 -0.512913 -1.228939
H  -0.573379 2.389155 1.727075
H  -1.314999 3.687005 0.769129
H  -6.186127 0.038005 0.870909
H  -5.247041 1.851197 2.27429
H  1.132677 2.110073 -0.171046
H  0.406874 3.512114 -0.956645
H  0.092272 -3.050331 1.17356
H  1.500725 2.912927 2.570232
H  2.79865 2.564483 1.414757
H  2.746065 4.124136 2.248067
H  3.894574 -4.327158 2.215311
H  3.505893 -3.148561 3.489923
H  5.184381 -3.673615 3.246157
H  5.253863 0.376867 -1.678959
H  4.892102 1.513737 -0.361916
H  4.496209 1.942364 -2.039093
elementType: S O N C H
totalener: -1781.75271135 hartree
nucrepener: 3051.76761877 hartree
electener: -4833.52033012 hartree
oneelecener: -8510.29494213 hartree
twoeener: 3676.77461201 hartree
cpcmener: -0.04846713 hartree
kineticenergy: 1775.29672826 hartree
xcener: -146.589408729100 hartree
chargesum: 0.0000000
charge: 0.876647 -0.306506 -0.500281 -0.506124 -0.386614 -0.448353 -0.272847 -0.277204 -0.200921 -0.134922 -0.407962 -0.431786 -0.388954 -0.167826 0.362669 -0.069497 -0.219384 -0.006913 -0.198980 -0.131175 0.064914 0.365458 0.406358 -0.090027 0.440178 0.449985 -0.116752 -0.114140 0.149794 0.142761 0.208679 0.111692 0.112221 0.162663 0.164726 0.030005 0.107788 0.193618 0.093622 0.070858 0.120997 0.118018 0.117509 0.132793 0.125008 0.112579 0.135628
qa: 0.8766 -0.3065 -0.5003 -0.5061 -0.3866 -0.4484 -0.2728 -0.2772 -0.2009 -0.1349 -0.4080 -0.4318 -0.3890 -0.1678 0.3627 -0.0695 -0.2194 -0.0069 -0.1990 -0.1312 0.0649 0.3655 0.4064 -0.0900 0.4402 0.4500 -0.1168 -0.1141 0.1498 0.1428 0.2087 0.1117 0.1122 0.1627 0.1647 0.0300 0.1078 0.1936 0.0936 0.0709 0.1210 0.1180 0.1175 0.1328 0.1250 0.1126 0.1356
va: 5.8428 2.0989 1.9983 1.9871 1.9377 2.0692 2.1360 2.1356 3.0749 3.2005 2.9547 2.9538 2.9336 3.8000 3.8276 3.9219 3.9084 3.8191 3.9461 3.9347 3.9798 4.4160 4.2070 3.9098 4.2778 4.1677 3.8460 3.8340 1.0156 1.0080 1.0687 0.9894 0.9920 0.9892 0.9868 1.0132 1.0011 1.0167 0.9836 0.9903 0.9920 0.9952 0.9952 0.9941 0.9975 0.9947 0.9922
dispcorr: -0.024993090 hartree
energy: -1781.777704440633
dipole: 13.98241 -11.61108 2.37133 13.71789 -13.21661 0.50128 15.70482 -12.01490 3.68992
magnitude: 4.41475 au
magnitude: 11.22139 debye
