program: Orca
programVersion: 4.2.1
elementType: S O O O O O O O N N N N N C C C C C C C C C C C C C C C H H H H H H H H H H H H H H H H H H H
charge: 0
multiplicity: 1
keywords: wb97x-d3
keywords: def2-TZVPP
keywords: def2/J RIJCOSX GRIDX6 NOFINALGRIDX
keywords: grid4 nofinalgrid
keywords: scfconv7
keywords: smallprint printgap noloewdin
keywords: NOSOSCF
formula: C15H19N5O7S
InChI: InChI=1S/C15H19N5O7S/c1-24-8-9-27-10-6-4-5-7-11(10)28(22,23)20-13(21)16-12-17-14(25-2)19-15(18-12)26-3/h4-7,16,20H,8-9H2,1-3H3
47 atoms
S  -2.194804 -1.502412 -0.244995
O  -1.004989 0.939218 0.794106
O  -1.938041 -1.903309 1.125054
O  -2.988141 -2.363658 -1.09577
O  -0.135809 1.328843 3.634451
O  -1.319009 -0.594096 -2.941437
O  2.968124 -1.200022 1.619952
O  5.235667 0.444703 -1.891463
N  -0.668436 -1.339997 -0.89589
N  0.869034 -0.459479 -2.400757
N  3.083783 -0.007819 -2.15327
N  1.861397 -0.867432 -0.338207
N  4.145958 -0.390635 -0.079596
C  -2.89019 0.116767 -0.298306
C  -2.211909 1.196891 0.286849
C  -4.130566 0.282979 -0.897354
C  -2.822829 2.448166 0.26667
C  -0.173985 1.986196 1.283025
C  -4.726774 1.531526 -0.909154
C  -4.067462 2.602359 -0.324645
C  -0.441439 2.356085 2.726335
C  -0.4476 -0.790876 -2.127151
C  1.973955 -0.450127 -1.596531
C  -1.205057 0.467425 3.953351
C  2.977276 -0.814834 0.369725
C  4.134642 -0.001697 -1.341305
C  1.745064 -1.66177 2.197641
C  6.42381 0.511261 -1.102604
H  -4.630652 -0.557981 -1.356832
H  -2.345145 3.312264 0.706607
H  0.120239 -1.351176 -0.237487
H  -0.245102 2.874484 0.648605
H  0.843746 1.607231 1.184634
H  -5.693667 1.664887 -1.373273
H  -4.523668 3.583488 -0.327527
H  0.216089 3.200914 2.953162
H  -1.470354 2.713811 2.862456
H  1.01906 -0.104106 -3.33679
H  -0.887578 -0.150066 4.794318
H  -2.097067 1.024377 4.264691
H  -1.48821 -0.197486 3.133833
H  1.995033 -1.953489 3.213707
H  1.351016 -2.526718 1.664955
H  0.998123 -0.86887 2.23165
H  7.186338 0.920545 -1.759333
H  6.732635 -0.475903 -0.760471
H  6.296288 1.168691 -0.243269
elementType: S O N C H
totalener: -1781.75113039 hartree
nucrepener: 3114.38575441 hartree
electener: -4896.13688480 hartree
oneelecener: -8635.00028439 hartree
twoeener: 3738.86339958 hartree
cpcmener: -0.04669714 hartree
kineticenergy: 1775.30249973 hartree
xcener: -146.592606682277 hartree
chargesum: 0.0000000
charge: 0.885851 -0.309129 -0.509603 -0.500473 -0.385636 -0.437357 -0.269143 -0.271715 -0.201160 -0.130625 -0.390973 -0.434952 -0.388528 -0.169120 0.379680 -0.070040 -0.224849 -0.013179 -0.201042 -0.136994 0.015079 0.344610 0.389391 -0.116535 0.422155 0.461974 -0.089323 -0.114881 0.151403 0.137489 0.213861 0.123436 0.107767 0.162286 0.163819 0.107150 0.090444 0.193323 0.123847 0.102933 0.090758 0.142264 0.125203 0.063690 0.132044 0.117811 0.116987
qa: 0.8859 -0.3091 -0.5096 -0.5005 -0.3856 -0.4374 -0.2691 -0.2717 -0.2012 -0.1306 -0.3910 -0.4350 -0.3885 -0.1691 0.3797 -0.0700 -0.2248 -0.0132 -0.2010 -0.1370 0.0151 0.3446 0.3894 -0.1165 0.4222 0.4620 -0.0893 -0.1149 0.1514 0.1375 0.2139 0.1234 0.1078 0.1623 0.1638 0.1071 0.0904 0.1933 0.1238 0.1029 0.0908 0.1423 0.1252 0.0637 0.1320 0.1178 0.1170
va: 5.8110 2.0454 1.9706 1.9952 1.8996 2.0801 2.1437 2.1378 3.0755 3.2047 2.9761 2.9329 2.9325 3.8047 3.7600 3.9349 3.9200 3.7900 3.9517 3.9352 3.9354 4.4380 4.2242 3.8672 4.2689 4.2351 3.8538 3.8433 1.0148 1.0133 1.0658 1.0074 1.0034 0.9897 0.9872 1.0036 0.9996 1.0167 0.9911 0.9983 0.9890 0.9981 0.9953 0.9987 0.9939 0.9960 0.9964
dispcorr: -0.028347839 hartree
energy: -1781.779478230965
dipole: 3.04142 -1.52828 1.51314 13.57625 -10.53487 3.04138 18.07528 -16.85634 1.21894
magnitude: 3.60907 au
magnitude: 9.17354 debye
