program: Gaussian 09
title: 000074127
version: EM64L-G09RevD.01
frameworkgroup: C1[X(C8H6Br4)]
method: RPBEPBE
basis: SDD
operation: Freq
keyword: #pfreq=noraman
keyword: PBEPBE/SDD
title: #p freq=noraman PBEPBE/SDD
converged: NO YES NO YES
title: Mulliken charges:
elementType: Br Br Br Br C C C C C C C C H H H H H H
charge: 0.068407 0.068401 0.068396 0.068413 0.598715 0.598714 -0.390416 -0.390417 -0.274108 -0.274110 -0.931408 -0.931410 0.239829 0.239831 0.265382 0.265384 0.355199 0.355199
chargesum: 0.00000
title: Mulliken charges with hydrogens summed into heavy atoms:
elementType: Br Br Br Br C C C C C C C C
charge: 0.068407 0.068401 0.068396 0.068413 0.598715 0.598714 -0.150586 -0.150587 -0.008726 -0.008726 -0.576209 -0.576211
polarizability: 2.19320175e+02 4.29508632e-03 1.54588259e+02 -4.06100071e-04 -1.05145289e-02 1.11270835e+02
1716.lowfreq: -4.4062 -0.0003 -0.0002 0.0002 4.0814 4.9726 13.5517 29.7094 53.4689
frequency: 13.5456 29.6686 53.4593 69.7069 74.5808 128.0744 150.3703 181.9342 188.4064 203.4685 306.2389 334.8036 399.9056 480.8786 533.8063 577.0690 599.1931 608.5876 617.8157 668.3980 753.4941 772.3208 834.4915 842.1161 853.3371 955.6680 981.1712 1009.6845 1118.7449 1146.4420 1147.0256 1183.6938 1188.9199 1198.5185 1234.1316 1236.3850 1322.2942 1386.8434 1413.3320 1495.5274 1576.4167 1611.9560 3125.8634 3129.8147 3130.4305 3145.6439 3147.9642 3165.7275
redmass: 47.7797 20.4632 4.1637 29.3975 34.4399 15.1562 22.4154 9.0711 6.8455 21.4567 6.9905 6.9044 2.8479 4.6457 7.5046 6.9310 5.8814 6.1471 3.1299 6.0477 3.8618 5.0785 1.2805 5.6128 1.6492 1.3955 1.3840 2.9344 1.4777 1.0655 1.0659 1.2129 1.2488 1.1257 2.2427 5.1031 1.2513 5.0700 3.0027 2.4922 6.6164 6.1976 1.0882 1.0890 1.0884 1.0881 1.0970 1.0976
irintensity: 0.0000 0.2278 0.4137 0.2159 0.0000 0.3698 2.2478 2.8797 8.5452 1.1164 18.5534 0.0000 0.0000 68.5357 1.0220 0.0000 13.9326 3.6125 333.5024 26.4618 0.0000 140.1586 1.4959 0.3556 5.1799 0.0000 0.0000 1.3596 12.2008 0.0001 70.0060 2.2813 1.2290 4.9619 130.4035 5.1813 2.6193 2.3026 28.0349 1.0428 5.1650 0.0084 4.2246 0.1459 3.3641 3.1077 12.7261 0.7424
temp: 298.150 k
press: 1.00000 atm
elementType: 35 35 35 35 6 6 6 6 6 6 6 6 1 1 1 1 1 1
symmnumber: 1
zpe: 301027.5 jmol-1
zpe.correction: 0.114655 hartree
zpe.thermalcorrener: 0.127721 hartree
zpe.thermalcorrenthalpy: 0.128665 hartree
zpe.thermalcorrgfe: 0.068494 hartree
zpe.sumelectzpe: -361.414715 hartree
zpe.sumelectthermal: -361.401649 hartree
zpe.sumelectthermalent: -361.400705 hartree
zpe.sumelectthermalfe: -361.460876 hartree
dipole: 0.0000 0.0001 2.4419
dipole: 2.4419
quadrupole: -121.3062 -113.3174 -96.5054
quadrupole: -0.0002 0.0000 -0.0005
quadrupole: -10.9299 -2.9411 13.8709 -0.0002 0.0000 -0.0005
hfenergy: -361.5293705 hartree
pointgroup: C01 [X(C8H6Br4)]
dipole: -0.0000005 -0.000206 -0.9607061 debye
dipolederiv: -0.4425588 0.2344109 0.0533489 0.3555515 -0.6435768 -0.1075905 0.2220071 -0.2202163 -0.1017614 -0.4426236 -0.2341063 0.0535027 -0.3554335 -0.6433569 0.1078429 0.2222195 0.2204037 -0.1019342 -0.4425006 0.234239 -0.0534465 0.355524 -0.6434994 0.1078466 -0.2221444 0.2204862 -0.1019037 -0.4424943 -0.2343579 -0.0533607 -0.3556023 -0.6435875 -0.1076149 -0.2219678 -0.2202115 -0.101764 -0.2933431 0.0000443 -0.0144099 0.0000864 -0.1975862 0.0000602 0.1163037 0.0001063 -0.0202125 -0.293331 -0.0002187 0.0144365 -0.0000209 -0.1976799 0.0000391 -0.116442 0.0003672 -0.0202243 -0.1009622 0.0001461 0.1817079 -0.0000257 -0.1113305 0.0000612 -0.0497489 0.0002262 0.0612818 -0.1011225 0.0000594 -0.1817163 -0.0000061 -0.1112981 0.0000894 0.0496664 0.0000601 0.0612705 -0.0554459 0.0000143 -0.1682141 -0.0000163 -0.0563562 0.0000512 -0.0699307 0.0000513 0.0124777 -0.0554098 0.0001037 0.1681812 0.0000232 -0.0563437 0.0000255 0.0698966 -0.000239 0.0124783 1.2732097 -0.0004235 -0.2179895 -0.0001576 1.5004163 -0.0003354 -0.4413353 -0.0000635 0.1998215 1.2730377 0.0000816 0.2179382 0.0000551 1.5007732 -0.0002931 0.4411841 -0.0003186 0.1997781 0.0093973 -0.0001401 -0.1061469 -0.0000079 0.135715 -0.0000555 -0.0864434 -0.0002586 -0.0174534 0.0093672 0.0000465 0.1061509 0.0000379 0.1357108 -0.0000692 0.0865165 -0.0001242 -0.0174596 0.0520063 0.0000544 0.0618421 -0.0000053 0.1173296 -0.0000491 0.0733767 -0.0000884 0.0108762 0.0520972 -0.0000012 -0.061828 -0.0000343 0.1174284 -0.0000419 -0.0732905 0.0000448 0.0108907 0.0003582 0.0000146 0.0865472 0.0000015 -0.1013188 0.0000183 -0.0133692 -0.0001387 -0.0430935 0.0003181 0.0000329 -0.0865437 0.0000302 -0.1014393 0.0000151 0.0135016 -0.0000868 -0.0430684 unknown
polarizability: 219.320174|-0.0084787|154.5882627|-0.0007586|-0.0010234|111.2708327 unknown
InChI: InChI=1S/C8H6Br4/c9-7(10)5-1-2-6(4-3-5)8(11)12/h1-4,7-8H
charge 0 multiplicity 1
18 atoms
Br -3.709367 1.660508 0.552826
Br -3.709566 -1.659736 0.553707
Br 3.709344 -1.660204 0.553704
Br 3.709534 1.660038 0.55278
C  -1.42017 0.000033 -0.259504
C  1.420137 -0.000168 -0.259514
C  -0.706027 -0.000392 -1.482762
C  0.705986 -0.000493 -1.482768
C  -0.701196 0.000346 0.96674
C  0.701171 0.000245 0.96674
C  -2.918938 0.000116 -0.309334
C  2.918904 -0.000263 -0.309351
H  -1.247055 -0.000646 -2.436176
H  1.247007 -0.000824 -2.436184
H  -1.251646 0.000674 1.913329
H  1.251623 0.000487 1.913324
H  -3.318803 -0.000136 -1.331019
H  3.318761 -0.000586 -1.331039
