program: Orca
programVersion: 4.2.1
elementType: S O O O O O O O N N N N N C C C C C C C C C C C C C C C H H H H H H H H H H H H H H H H H H H
charge: 0
multiplicity: 1
keywords: wb97x-d3
keywords: def2-TZVPP
keywords: def2/J RIJCOSX GRIDX6 NOFINALGRIDX
keywords: grid4 nofinalgrid
keywords: scfconv7
keywords: smallprint printgap noloewdin
keywords: NOSOSCF
formula: C15H19N5O7S
InChI: InChI=1S/C15H19N5O7S/c1-24-8-9-27-10-6-4-5-7-11(10)28(22,23)20-13(21)16-12-17-14(25-2)19-15(18-12)26-3/h4-7,16,20H,8-9H2,1-3H3
47 atoms
S  -2.26685 -1.567383 -0.075803
O  -1.52963 1.03268 1.006392
O  -2.002974 -1.858513 1.31979
O  -2.907357 -2.570205 -0.900602
O  1.018468 2.835948 2.826377
O  -1.427407 -0.607558 -2.768576
O  3.012189 -1.59606 1.575031
O  5.200637 0.172849 -1.927187
N  -0.755644 -1.227403 -0.690915
N  0.763124 -0.419424 -2.252901
N  3.011656 -0.114823 -2.095821
N  1.825662 -1.000794 -0.269659
N  4.153699 -0.732194 -0.123436
C  -3.165712 -0.063026 -0.244375
C  -2.692649 1.11121 0.358309
C  -4.359008 -0.078529 -0.951388
C  -3.444968 2.274581 0.223387
C  -0.977634 2.198639 1.600205
C  -5.107105 1.080222 -1.063305
C  -4.641342 2.247441 -0.477215
C  0.329353 1.761991 2.245939
C  -0.546991 -0.754138 -1.952488
C  1.903258 -0.516744 -1.506906
C  0.473055 3.291021 4.043833
C  2.981809 -1.099256 0.364701
C  4.101897 -0.240369 -1.347988
C  1.7989 -2.068584 2.162371
C  6.434297 0.082493 -1.214184
H  -4.704121 -0.991209 -1.416352
H  -3.112917 3.205665 0.661164
H  0.046622 -1.278659 -0.052935
H  -1.671703 2.606689 2.341317
H  -0.78644 2.965242 0.842679
H  -6.039314 1.071143 -1.610203
H  -5.214121 3.161174 -0.565187
H  0.127724 0.97241 2.983283
H  0.984841 1.345944 1.476931
H  0.893796 -0.057928 -3.189628
H  1.183673 3.992367 4.480789
H  -0.479658 3.816367 3.919568
H  0.320056 2.471748 4.756008
H  2.080881 -2.472445 3.130342
H  1.344794 -2.857978 1.564069
H  1.084108 -1.259254 2.314038
H  7.187032 0.490257 -1.883009
H  6.683284 -0.951235 -0.976468
H  6.410148 0.669573 -0.29669
elementType: S O N C H
totalener: -1781.75212924 hartree
nucrepener: 3053.08084784 hartree
electener: -4834.83297709 hartree
oneelecener: -8512.51971256 hartree
twoeener: 3677.68673547 hartree
cpcmener: -0.04753359 hartree
kineticenergy: 1775.29925085 hartree
xcener: -146.591909956923 hartree
chargesum: -0.0000000
charge: 0.875085 -0.305179 -0.508955 -0.501150 -0.385230 -0.445583 -0.268183 -0.271268 -0.194769 -0.132112 -0.392294 -0.443526 -0.386721 -0.177516 0.375282 -0.072255 -0.219197 0.010586 -0.197731 -0.131343 0.013742 0.358062 0.398403 -0.107152 0.425726 0.461951 -0.118935 -0.115326 0.150509 0.142907 0.203429 0.113138 0.111994 0.162474 0.164139 0.091028 0.087850 0.193829 0.119048 0.092652 0.093082 0.140403 0.126685 0.094808 0.132160 0.117933 0.117518
qa: 0.8751 -0.3052 -0.5090 -0.5011 -0.3852 -0.4456 -0.2682 -0.2713 -0.1948 -0.1321 -0.3923 -0.4435 -0.3867 -0.1775 0.3753 -0.0723 -0.2192 0.0106 -0.1977 -0.1313 0.0137 0.3581 0.3984 -0.1072 0.4257 0.4620 -0.1189 -0.1153 0.1505 0.1429 0.2034 0.1131 0.1120 0.1625 0.1641 0.0910 0.0879 0.1938 0.1190 0.0927 0.0931 0.1404 0.1267 0.0948 0.1322 0.1179 0.1175
va: 5.8350 2.1009 1.9803 1.9971 1.9472 2.0745 2.1419 2.1386 3.0729 3.2047 2.9770 2.9245 2.9350 3.7945 3.8197 3.9275 3.9037 3.7770 3.9482 3.9385 3.9900 4.4242 4.2175 3.9033 4.2654 4.2364 3.8469 3.8427 1.0152 1.0076 1.0705 0.9856 0.9934 0.9894 0.9872 0.9927 1.0012 1.0166 0.9910 0.9825 0.9918 0.9988 0.9935 0.9908 0.9938 0.9959 0.9962
dispcorr: -0.025533136 hartree
energy: -1781.777662380361
dipole: 6.14514 -4.92518 1.21996 16.39755 -13.86150 2.53606 17.97174 -16.37172 1.60002
magnitude: 3.23728 au
magnitude: 8.22851 debye
