program: Orca
programVersion: 4.2.1
elementType: S O O O O O O O N N N N N C C C C C C C C C C C C C C C H H H H H H H H H H H H H H H H H H H
charge: 0
multiplicity: 1
keywords: wb97x-d3
keywords: def2-TZVPP
keywords: def2/J RIJCOSX GRIDX6 NOFINALGRIDX
keywords: grid4 nofinalgrid
keywords: scfconv7
keywords: smallprint printgap noloewdin
keywords: NOSOSCF
formula: C15H19N5O7S
InChI: InChI=1S/C15H19N5O7S/c1-24-8-9-27-10-6-4-5-7-11(10)28(22,23)20-13(21)16-12-17-14(25-2)19-15(18-12)26-3/h4-7,16,20H,8-9H2,1-3H3
47 atoms
S  -2.277515 -1.489662 -0.556322
O  -1.521008 1.325715 -0.563712
O  -2.933709 -2.726342 -0.189451
O  -2.009757 -1.215286 -1.954658
O  1.120825 3.645207 -1.395484
O  -1.448873 -1.690752 2.29465
O  2.992521 -0.788628 -2.060701
O  5.170591 -0.570219 1.863611
N  -0.765967 -1.434646 0.145002
N  0.747593 -1.341449 1.906529
N  2.990804 -0.959939 1.894869
N  1.812356 -1.048115 -0.136894
N  4.128912 -0.670659 -0.154341
C  -3.15956 -0.157892 0.186286
C  -2.68108 1.155121 0.072833
C  -4.345106 -0.437168 0.850377
C  -3.425442 2.182626 0.645503
C  -0.948721 2.623512 -0.637971
C  -5.082303 0.594144 1.404948
C  -4.615074 1.89536 1.297561
C  0.379832 2.456243 -1.361731
C  -0.563135 -1.508691 1.491506
C  1.886884 -1.108096 1.190367
C  0.643189 4.609316 -2.305738
C  2.963461 -0.839877 -0.752991
C  4.076743 -0.735245 1.163914
C  1.786181 -1.022217 -2.789778
C  6.394909 -0.306453 1.177462
H  -4.691922 -1.457211 0.937222
H  -3.091228 3.209299 0.589307
H  0.041391 -1.237828 -0.457951
H  -0.778978 3.030066 0.36412
H  -1.618406 3.298931 -1.179216
H  -6.00821 0.380749 1.920057
H  -5.180649 2.709216 1.731791
H  0.985042 1.725167 -0.820286
H  0.20227 2.066785 -2.374008
H  0.873763 -1.383477 2.910268
H  0.506516 4.193108 -3.310649
H  -0.303231 5.063116 -1.993501
H  1.388452 5.402285 -2.365072
H  1.382371 -2.0139 -2.586864
H  2.060666 -0.956761 -3.838595
H  1.032263 -0.264322 -2.575846
H  7.145384 -0.192961 1.954721
H  6.335997 0.612214 0.594737
H  6.67237 -1.132845 0.524037
elementType: S O N C H
totalener: -1781.75189214 hartree
nucrepener: 3057.76772264 hartree
electener: -4839.51961478 hartree
oneelecener: -8521.90488461 hartree
twoeener: 3682.38526983 hartree
cpcmener: -0.04752285 hartree
kineticenergy: 1775.29813591 hartree
xcener: -146.591829911579 hartree
chargesum: 0.0000000
charge: 0.876983 -0.305404 -0.500696 -0.509526 -0.384485 -0.446021 -0.268633 -0.270785 -0.197165 -0.132155 -0.391883 -0.444166 -0.384374 -0.174289 0.371852 -0.071940 -0.220387 0.010578 -0.198060 -0.131978 0.017630 0.360209 0.400337 -0.107660 0.422817 0.461254 -0.115482 -0.115641 0.151046 0.143330 0.203145 0.110448 0.114263 0.162404 0.164386 0.082055 0.092172 0.193525 0.092790 0.093368 0.118959 0.130393 0.140477 0.088117 0.132303 0.117891 0.117999
qa: 0.8770 -0.3054 -0.5007 -0.5095 -0.3845 -0.4460 -0.2686 -0.2708 -0.1972 -0.1322 -0.3919 -0.4442 -0.3844 -0.1743 0.3719 -0.0719 -0.2204 0.0106 -0.1981 -0.1320 0.0176 0.3602 0.4003 -0.1077 0.4228 0.4613 -0.1155 -0.1156 0.1510 0.1433 0.2031 0.1104 0.1143 0.1624 0.1644 0.0821 0.0922 0.1935 0.0928 0.0934 0.1190 0.1304 0.1405 0.0881 0.1323 0.1179 0.1180
va: 5.8338 2.1007 1.9975 1.9797 1.9479 2.0742 2.1398 2.1388 3.0724 3.2060 2.9770 2.9230 2.9354 3.7954 3.8248 3.9242 3.9044 3.7771 3.9481 3.9393 3.9888 4.4228 4.2156 3.9040 4.2651 4.2366 3.8442 3.8426 1.0148 1.0072 1.0720 0.9944 0.9848 0.9893 0.9872 1.0004 0.9912 1.0168 0.9916 0.9824 0.9910 0.9928 0.9988 0.9928 0.9935 0.9961 0.9961
dispcorr: -0.025693971 hartree
energy: -1781.777586112116
dipole: 6.64057 -5.36989 1.27068 22.49172 -19.46438 3.02735 -9.82187 9.34904 -0.47282
magnitude: 3.31708 au
magnitude: 8.43135 debye
