program: Orca
programVersion: 4.2.1
elementType: S O O O O O O O N N N N N C C C C C C C C C C C C C C C H H H H H H H H H H H H H H H H H H H
charge: 0
multiplicity: 1
keywords: wb97x-d3
keywords: def2-TZVPP
keywords: def2/J RIJCOSX GRIDX6 NOFINALGRIDX
keywords: grid4 nofinalgrid
keywords: scfconv7
keywords: smallprint printgap noloewdin
keywords: NOSOSCF
formula: C15H19N5O7S
InChI: InChI=1S/C15H19N5O7S/c1-24-8-9-27-10-6-4-5-7-11(10)28(22,23)20-13(21)16-12-17-14(25-2)19-15(18-12)26-3/h4-7,16,20H,8-9H2,1-3H3
47 atoms
S  -2.197001 -1.375121 -0.54718
O  -1.541199 1.480515 -0.445769
O  -2.816224 -2.643477 -0.220992
O  -1.895086 -1.068588 -1.931923
O  0.405628 2.500027 -2.296285
O  -1.430818 -1.625363 2.332085
O  3.028948 -0.556658 -1.943774
O  5.203015 -0.512498 1.989903
N  -0.716328 -1.275831 0.205256
N  0.770804 -1.249959 1.988364
N  3.020726 -0.888069 2.002642
N  1.849484 -0.888133 -0.033153
N  4.165692 -0.522413 -0.032365
C  -3.158525 -0.092442 0.176696
C  -2.731572 1.242266 0.107892
C  -4.36666 -0.433481 0.766887
C  -3.563085 2.22489 0.641623
C  -1.034923 2.810207 -0.418353
C  -5.183183 0.55348 1.289064
C  -4.77419 1.875797 1.218325
C  0.376819 2.82556 -0.932848
C  -0.535543 -1.406247 1.549303
C  1.917764 -1.000937 1.290309
C  1.653271 2.762351 -2.888193
C  3.000657 -0.661988 -0.64002
C  4.109194 -0.64109 1.282247
C  1.816683 -0.746304 -2.679486
C  6.429976 -0.229995 1.316674
H  -4.672044 -1.468567 0.820752
H  -3.282642 3.267864 0.611971
H  0.103514 -1.05491 -0.372829
H  -1.023946 3.192033 0.606774
H  -1.664592 3.469964 -1.023435
H  -6.125685 0.289816 1.746919
H  -5.40354 2.657834 1.622024
H  0.76045 3.840141 -0.758217
H  1.00507 2.144917 -0.342367
H  0.884318 -1.332932 2.99093
H  2.473328 2.219839 -2.405605
H  1.604082 2.451016 -3.930442
H  1.901924 3.82984 -2.861804
H  1.432615 -1.757833 -2.551187
H  2.083083 -0.597287 -3.721127
H  1.052296 -0.021759 -2.401857
H  6.696524 -1.024198 0.620542
H  7.182708 -0.166999 2.097252
H  6.382594 0.718518 0.783088
elementType: S O N C H
totalener: -1781.75631078 hartree
nucrepener: 3090.07616139 hartree
electener: -4871.83247217 hartree
oneelecener: -8587.04398358 hartree
twoeener: 3715.21151140 hartree
cpcmener: -0.04932748 hartree
kineticenergy: 1775.32747678 hartree
xcener: -146.596991579505 hartree
chargesum: -0.0000000
charge: 0.874718 -0.294961 -0.503795 -0.507281 -0.368440 -0.447054 -0.270450 -0.270833 -0.197308 -0.132466 -0.390700 -0.429981 -0.386846 -0.162166 0.373462 -0.075601 -0.225573 0.017013 -0.199262 -0.133984 -0.000126 0.360721 0.391112 -0.129407 0.420738 0.460595 -0.145230 -0.115721 0.150870 0.143068 0.208207 0.106462 0.108742 0.162661 0.164320 0.104162 0.077964 0.192957 0.088600 0.122354 0.108160 0.142273 0.145390 0.094650 0.117978 0.132451 0.117555
qa: 0.8747 -0.2950 -0.5038 -0.5073 -0.3684 -0.4471 -0.2705 -0.2708 -0.1973 -0.1325 -0.3907 -0.4300 -0.3868 -0.1622 0.3735 -0.0756 -0.2256 0.0170 -0.1993 -0.1340 -0.0001 0.3607 0.3911 -0.1294 0.4207 0.4606 -0.1452 -0.1157 0.1509 0.1431 0.2082 0.1065 0.1087 0.1627 0.1643 0.1042 0.0780 0.1930 0.0886 0.1224 0.1082 0.1423 0.1454 0.0946 0.1180 0.1325 0.1176
va: 5.8362 2.1125 1.9944 1.9813 1.9175 2.0742 2.1298 2.1381 3.0754 3.2054 2.9763 2.9300 2.9324 3.7901 3.8205 3.9248 3.9013 3.8833 3.9482 3.9391 3.9688 4.4252 4.2252 3.8971 4.2575 4.2377 3.8305 3.8425 1.0155 1.0072 1.0688 0.9933 0.9961 0.9894 0.9874 1.0010 0.9989 1.0169 0.9869 0.9880 0.9947 0.9957 0.9947 1.0030 0.9962 0.9935 0.9962
dispcorr: -0.026694390 hartree
energy: -1781.783005169659
dipole: 10.33425 -8.12699 2.20726 20.24952 -16.79539 3.45413 -8.65918 8.97575 0.31657
magnitude: 4.11136 au
magnitude: 10.45024 debye
