program: Orca
programVersion: 4.2.1
elementType: S O O O O O O O N N N N N C C C C C C C C C C C C C C C H H H H H H H H H H H H H H H H H H H
charge: 0
multiplicity: 1
keywords: wb97x-d3
keywords: def2-TZVPP
keywords: def2/J RIJCOSX GRIDX6 NOFINALGRIDX
keywords: grid4 nofinalgrid
keywords: scfconv7
keywords: smallprint printgap noloewdin
keywords: NOSOSCF
formula: C15H19N5O7S
InChI: InChI=1S/C15H19N5O7S/c1-24-8-9-27-10-6-4-5-7-11(10)28(22,23)20-13(21)16-12-17-14(25-2)19-15(18-12)26-3/h4-7,16,20H,8-9H2,1-3H3
47 atoms
S  -1.964886 -0.022153 -1.911551
O  -0.972872 1.327728 0.462486
O  -2.790919 -0.885138 -2.72971
O  -1.316583 1.122099 -2.520256
O  0.700122 3.995585 0.485387
O  -1.984864 -2.516282 -0.314664
O  4.392075 -2.640556 1.97511
O  3.323487 0.666534 -0.868227
N  -0.700585 -0.909886 -1.280274
N  0.207247 -2.446534 0.212198
N  1.7794 -0.840214 -0.368367
N  2.287654 -2.592274 1.117098
N  3.928465 -0.986812 0.575198
C  -2.910785 0.482428 -0.511922
C  -2.296392 1.180986 0.539182
C  -4.273293 0.222177 -0.506821
C  -3.096285 1.628485 1.588277
C  -0.244103 1.962812 1.508059
C  -5.055728 0.671401 0.542508
C  -4.459361 1.374066 1.578555
C  -0.223255 3.477638 1.405766
C  -0.908942 -1.984215 -0.46374
C  1.466833 -1.927931 0.311275
C  0.423546 3.720824 -0.86938
C  3.496625 -2.07365 1.206585
C  3.029357 -0.414864 -0.194295
C  4.030731 -3.808844 2.711932
C  4.63832 1.211218 -0.755005
H  -4.725022 -0.329758 -1.319203
H  -2.676089 2.177314 2.41929
H  0.222745 -0.457275 -1.250764
H  0.770676 1.570824 1.430301
H  -0.627414 1.656487 2.485017
H  -6.118233 0.473453 0.549243
H  -5.060958 1.733296 2.403081
H  -1.234805 3.861014 1.207502
H  0.074826 3.862878 2.383827
H  0.036803 -3.269557 0.77606
H  -0.62905 3.891231 -1.121945
H  1.029281 4.401668 -1.468893
H  0.685253 2.698471 -1.156733
H  3.214296 -3.607261 3.404686
H  4.91909 -4.085379 3.272873
H  3.751405 -4.628565 2.050714
H  4.646378 2.087338 -1.397232
H  5.393782 0.504766 -1.097427
H  4.85952 1.511008 0.26882
elementType: S O N C H
totalener: -1781.75163264 hartree
nucrepener: 3085.88621244 hartree
electener: -4867.63784508 hartree
oneelecener: -8578.72012246 hartree
twoeener: 3711.08227739 hartree
cpcmener: -0.04841502 hartree
kineticenergy: 1775.29712161 hartree
xcener: -146.589892984661 hartree
chargesum: -0.0000000
charge: 0.879147 -0.307811 -0.502685 -0.505155 -0.382259 -0.443139 -0.273082 -0.271552 -0.197664 -0.133275 -0.396409 -0.429651 -0.394142 -0.173014 0.382183 -0.078498 -0.225376 -0.000123 -0.201730 -0.133276 -0.003924 0.349526 0.392532 -0.084029 0.441583 0.457559 -0.116862 -0.117040 0.151408 0.139585 0.211336 0.107877 0.118162 0.161703 0.163963 0.093511 0.108591 0.193776 0.087667 0.119170 0.074191 0.117599 0.132684 0.117594 0.131430 0.119854 0.118067
qa: 0.8791 -0.3078 -0.5027 -0.5052 -0.3823 -0.4431 -0.2731 -0.2716 -0.1977 -0.1333 -0.3964 -0.4297 -0.3941 -0.1730 0.3822 -0.0785 -0.2254 -0.0001 -0.2017 -0.1333 -0.0039 0.3495 0.3925 -0.0840 0.4416 0.4576 -0.1169 -0.1170 0.1514 0.1396 0.2113 0.1079 0.1182 0.1617 0.1640 0.0935 0.1086 0.1938 0.0877 0.1192 0.0742 0.1176 0.1327 0.1176 0.1314 0.1199 0.1181
va: 5.8255 2.0622 1.9914 1.9824 1.9174 2.0722 2.1349 2.1412 3.0730 3.1981 2.9603 2.9535 2.9435 3.8050 3.7768 3.9398 3.9121 3.7650 3.9528 3.9390 3.9593 4.4324 4.2165 3.8982 4.2755 4.1680 3.8463 3.8413 1.0154 1.0093 1.0730 1.0093 1.0028 0.9897 0.9869 0.9976 0.9981 1.0160 1.0014 0.9902 0.9928 0.9953 0.9941 0.9952 0.9929 0.9973 0.9957
dispcorr: -0.026368331 hartree
energy: -1781.778000967025
dipole: 8.31255 -6.49762 1.81493 13.57354 -13.42535 0.14818 13.10661 -9.32301 3.78360
magnitude: 4.19900 au
magnitude: 10.67300 debye
