program: Gaussian 09
title: 000007597
version: EM64L-G09RevD.01
frameworkgroup: C1[X(C13H10O3)]
method: RPBEPBE
basis: SDD
operation: Freq
keyword: #pfreq=noraman
keyword: PBEPBE/SDD
title: #p freq=noraman PBEPBE/SDD
converged: YES YES NO NO
title: Mulliken charges:
elementType: O O O C C C C C C C C C C C C C H H H H H H H H H H
charge: -0.287321 -0.286990 -0.207016 0.400279 0.400250 -0.346077 -0.345982 -0.345995 -0.345899 -0.195209 -0.195228 -0.195234 -0.195257 -0.236834 -0.236742 0.225152 0.249919 0.250018 0.249903 0.250000 0.232195 0.232254 0.232191 0.232253 0.232675 0.232696
chargesum: 0.00000
title: Mulliken charges with hydrogens summed into heavy atoms:
elementType: O O O C C C C C C C C C C C C C
charge: -0.287321 -0.286990 -0.207016 0.400279 0.400250 -0.096158 -0.095964 -0.096091 -0.095899 0.036986 0.037026 0.036957 0.036995 -0.004159 -0.004046 0.225152
polarizability: 2.04127251e+02 2.60962635e-02 1.43236131e+02 -4.19743915e-03 1.82364731e-04 7.82233897e+01
1716.lowfreq: -44.7064 -27.9571 0.0008 0.0011 0.0011 5.6885 6.9183 17.1367 36.7176
frequency: -44.7013 -27.9525 36.7139 48.6185 67.8165 113.5113 224.9625 243.2910 267.4075 377.6198 390.6600 408.2487 408.4534 474.9276 492.1241 504.4371 610.2612 610.4970 628.6025 650.1671 676.5717 690.2425 690.3686 746.8169 767.7396 778.1749 821.5942 832.8544 833.8587 912.2108 915.6795 936.7827 968.5893 968.8724 986.7090 989.8956 993.2509 993.4681 1018.3620 1020.7608 1074.2042 1074.8231 1118.1802 1150.8815 1167.6909 1172.1653 1172.2161 1178.9709 1199.1946 1303.9152 1305.0942 1384.9298 1385.2696 1441.0528 1442.0261 1471.6329 1473.2162 1599.8148 1601.4754 1607.2844 1608.4563 1663.1896 3134.6889 3134.7416 3145.1223 3145.2471 3158.7837 3158.9525 3168.6735 3168.7998 3177.0540 3177.1394
redmass: 6.1118 3.7660 7.2304 5.9433 6.1324 6.2043 6.2547 5.5338 5.9189 6.0061 6.4967 2.8591 2.8633 4.0434 3.3602 7.6591 6.5368 6.5477 6.8558 5.3108 12.5203 1.9654 2.2105 1.8032 5.5262 1.9331 4.3258 1.2473 1.2470 1.7883 1.4430 4.4784 1.3780 1.3776 6.1292 5.7843 1.3303 1.3461 2.1724 2.0130 1.4969 1.4961 11.1255 2.2453 1.2342 1.0558 1.0558 1.3969 3.2031 1.3227 1.3190 10.1530 10.2148 2.2117 2.2194 2.2907 2.3161 6.3662 6.2614 6.9522 6.9896 12.4957 1.0852 1.0852 1.0893 1.0893 1.0934 1.0934 1.0969 1.0969 1.1012 1.1012
irintensity: 0.0044 0.0000 1.3441 1.5008 0.0000 1.9663 1.1199 0.0157 8.0570 3.4699 0.0000 0.0002 0.0465 0.0009 28.8552 5.0235 0.5227 0.0014 1.9676 5.6951 14.2189 9.2567 60.3142 80.6613 11.3724 43.8333 52.3837 0.0000 0.0681 2.8122 3.7796 17.0713 0.0000 0.1300 62.9999 0.0121 0.5289 0.7649 46.4630 0.5625 0.0109 24.0497 1691.8559 10.6121 0.2855 0.0120 0.0474 0.2033 0.2862 0.0000 0.1290 0.1024 1.9532 0.0204 9.2602 122.7504 3.3177 5.6777 49.3318 0.1295 12.0144 240.3340 0.2976 0.0646 7.0364 11.1613 47.7921 5.4600 1.4435 25.2459 9.3322 0.9945
temp: 298.150 k
press: 1.00000 atm
elementType: 8 8 8 6 6 6 6 6 6 6 6 6 6 6 6 6 1 1 1 1 1 1 1 1 1 1
symmnumber: 1
zpe: 510004.0 jmol-1
zpe.correction: 0.194250 hartree
zpe.thermalcorrener: 0.205862 hartree
zpe.thermalcorrenthalpy: 0.206807 hartree
zpe.thermalcorrgfe: 0.154867 hartree
zpe.sumelectzpe: -725.922728 hartree
zpe.sumelectthermal: -725.911116 hartree
zpe.sumelectthermalent: -725.910172 hartree
zpe.sumelectthermalfe: -725.962112 hartree
dipole: -0.0111 0.0001 -0.4499
dipole: 0.4500
quadrupole: -66.2006 -77.0640 -102.9811
quadrupole: 0.0056 0.0009 -0.0001
quadrupole: 15.8813 5.0179 -20.8992 0.0056 0.0009 -0.0001
hfenergy: -726.1169787 hartree
pointgroup: C01 [X(C13H10O3)]
dipole: 0.0043286 0.0002106 0.1770067 debye
dipolederiv: -2.2813968 -0.000204 -0.1374668 -0.0001266 -0.248777 -0.0002562 -0.2745314 -0.0002092 -0.4905286 -2.280562 0.0000198 0.136762 0.0003257 -0.2484925 -0.0001956 0.2764836 -0.00024 -0.4901916 -0.8693287 0.0000036 0.0000713 -0.0000889 -0.2466336 -0.0005954 -0.0009437 -0.0005804 -0.8884188 1.4072646 -0.0001264 -0.1322625 -0.0004269 0.2115048 -0.0002124 -0.5319556 -0.0002388 0.0670275 1.4063567 0.0001567 0.132675 0.0006143 0.2116222 -0.0000493 0.5315407 -0.0000179 0.067322 -0.2739927 0.0607122 -0.0326457 0.1055698 -0.0240461 -0.0433352 0.0515029 -0.0094479 -0.1125092 -0.2739755 0.0608545 0.032384 0.1048906 -0.0241434 0.0430684 -0.0519262 0.0093044 -0.1125363 -0.2737623 -0.0609093 -0.0324194 -0.1056497 -0.0239855 0.0429932 0.052022 0.0090678 -0.112715 -0.2737474 -0.0609358 0.0323992 -0.1051842 -0.024299 -0.0430648 -0.0520308 -0.0092742 -0.1125386 0.0059227 -0.0630921 -0.0619131 -0.0520317 0.1002625 0.0290669 -0.0658387 0.0254446 -0.112032 0.0058309 -0.0630746 0.0620749 -0.0517648 0.1001129 -0.0294772 0.0660539 -0.0259445 -0.1118299 0.0058433 0.062805 -0.0621134 0.0517427 0.100179 -0.0298409 -0.065991 -0.0262505 -0.1118142 0.0057495 0.0630181 0.0620292 0.0517175 0.1002489 0.0294395 0.0660016 0.025933 -0.1118285 0.0440672 -0.0001081 -0.0985942 -0.0001066 -0.094562 -0.0001003 -0.0861831 -0.0000894 -0.1243787 0.0442176 0.0000831 0.0987525 0.0000659 -0.0944891 0.0000475 0.086417 0.0000377 -0.1241264 3.3268536 0.0002019 0.0005448 -0.000152 0.2774059 0.001113 -0.0002691 0.0010964 1.4846571 0.0813465 -0.0784009 0.0488953 -0.0879624 -0.0026422 0.024296 0.041155 0.0230249 0.1419647 0.0815384 -0.0784132 -0.0487611 -0.0879864 -0.0024423 -0.0240246 -0.041031 -0.0227525 0.1420625 0.0811893 0.0786215 0.0486448 0.0881753 -0.0026997 -0.0237641 0.0408611 -0.0224816 0.1421057 0.0813681 0.0784547 -0.0488146 0.0880518 -0.0023124 0.0240428 -0.0410801 0.0227669 0.1420221 0.0316625 0.074794 0.0379216 0.0902424 -0.0602429 -0.028607 0.0500615 -0.0282805 0.1437207 0.0317043 0.0746638 -0.0381345 0.090056 -0.0600117 0.029026 -0.0502858 0.0287098 0.1435789 0.0317826 -0.0745709 0.0381615 -0.0899979 -0.0601515 0.0293466 0.0503592 0.0290307 0.1435151 0.031838 -0.0745768 -0.0380847 -0.0899956 -0.0601503 -0.0289858 -0.0502312 -0.0286769 0.1435977 -0.0889929 0.0001052 0.0947298 0.0001125 0.0893656 0.0001013 0.1027167 0.0001028 0.1270071 -0.0887774 -0.0000819 -0.094836 -0.0000907 0.0893793 -0.0000327 -0.1028776 -0.0000345 0.1268667 unknown
polarizability: 204.1272436|-0.0242334|143.2360704|0.0336083|-0.0618314|78.2234573 unknown
InChI: InChI=1S/C13H10O3/c14-13(15-11-7-3-1-4-8-11)16-12-9-5-2-6-10-12/h1-10H
charge 0 multiplicity 1
26 atoms
O  -1.110326 -0.000827 -0.983802
O  1.106104 -0.000738 -0.983444
O  -0.00243 0.001138 1.103775
C  -2.410912 -0.000307 -0.365561
C  2.406989 -0.000038 -0.363922
C  -3.041502 1.232283 -0.114735
C  3.037141 -1.232241 -0.110575
C  -3.040588 -1.232487 -0.11045
C  3.036137 1.232767 -0.110992
C  -4.350615 1.225484 0.417422
C  4.345914 -1.224291 0.422376
C  -4.349698 -1.224795 0.421693
C  4.344912 1.22607 0.421963
C  -5.004928 0.000565 0.68647
C  4.999942 0.001201 0.689417
C  -0.001825 -0.000009 -0.137113
H  -2.518277 2.168015 -0.334149
H  2.513875 -2.168272 -0.328603
H  -2.516685 -2.168604 -0.326576
H  2.512113 2.168303 -0.329327
H  -4.856437 2.17554 0.619901
H  4.851674 -2.173909 0.626986
H  -4.854816 -2.174511 0.627504
H  4.849895 2.176171 0.626249
H  -6.01975 0.000903 1.098174
H  6.014494 0.00169 1.101816
