program: Gaussian 09
title: 000069114
version: EM64L-G09RevD.01
frameworkgroup: C1[X(C6H5NO3)]
method: RPBEPBE
basis: SDD
operation: Freq
keyword: #pfreq=noraman
keyword: PBEPBE/SDD
title: #p freq=noraman PBEPBE/SDD
converged: NO YES NO NO
title: Mulliken charges:
elementType: O O O N C C C C C C H H H H H
charge: -0.226519 -0.382928 -0.274725 -0.352284 0.085043 0.101101 -0.219925 -0.203253 -0.166851 0.133135 0.286108 0.342220 0.244678 0.255047 0.379153
chargesum: 0.00000
title: Mulliken charges with hydrogens summed into heavy atoms:
elementType: O O O N C C C C C C
charge: -0.226519 -0.003775 -0.274725 -0.010063 0.085043 0.101101 0.066183 0.041425 0.088196 0.133135
polarizability: 1.16936837e+02 3.96132376e+00 9.64309149e+01 -1.02540319e-02 1.79169184e-02 3.27184347e+01
1716.lowfreq: -0.0013 -0.0009 -0.0009 0.6344 5.0646 9.6111 35.8064 102.4990 206.3844
frequency: 35.7939 102.4946 206.3844 214.8262 352.1500 368.7745 405.9419 509.5491 529.4548 547.0264 588.4279 612.0090 693.1635 697.3471 756.1159 767.1914 809.5691 851.6198 946.6991 995.7742 1014.6913 1025.3306 1067.9034 1139.7001 1166.5852 1234.7362 1318.0294 1352.4161 1404.0791 1449.1700 1551.2639 1595.1836 1602.3575 1663.3998 3147.2308 3161.2900 3201.5933 3499.7189 3501.8071
redmass: 10.3815 5.2620 7.4900 5.0558 9.4288 9.5708 3.5235 2.5375 6.3310 7.9058 5.2147 1.3446 3.2473 5.3888 1.8961 1.4363 2.3880 6.4560 1.3263 1.3978 7.1168 3.4072 2.1520 1.3145 1.9614 1.3205 1.8126 3.9090 1.8456 2.6859 6.5183 3.9680 8.3070 7.4735 1.0912 1.0919 1.0987 1.0638 1.0779
irintensity: 5.9912 4.8605 5.8770 1.2597 0.9853 7.3083 5.3383 9.5079 9.9661 16.7800 48.4713 112.7010 80.5095 7.7291 0.0241 152.7513 6.7600 0.5108 2.0718 1.9705 115.9605 127.0771 27.2065 10.2974 77.3274 52.7121 62.8681 25.4080 0.5086 34.4939 179.1792 72.3763 189.2529 454.2430 0.5132 2.6077 6.2117 37.9417 56.3314
temp: 298.150 k
press: 1.00000 atm
elementType: 8 8 8 7 6 6 6 6 6 6 1 1 1 1 1
symmnumber: 1
zpe: 275660.3 jmol-1
zpe.correction: 0.104993 hartree
zpe.thermalcorrener: 0.113275 hartree
zpe.thermalcorrenthalpy: 0.114219 hartree
zpe.thermalcorrgfe: 0.070920 hartree
zpe.sumelectzpe: -511.355436 hartree
zpe.sumelectthermal: -511.347154 hartree
zpe.sumelectthermalent: -511.346210 hartree
zpe.sumelectthermalfe: -511.389509 hartree
dipole: -4.7980 -1.4645 0.0055
dipole: 5.0165
quadrupole: -39.6307 -64.1552 -58.4798
quadrupole: 2.4396 -0.0084 0.0373
quadrupole: 14.4579 -10.0666 -4.3913 2.4396 -0.0084 0.0373
hfenergy: -511.4604291 hartree
pointgroup: C01 [X(C6H5N1O3)]
dipole: 1.8842618 0.5852991 -0.0478514 debye
dipolederiv: -0.4003757 -0.1903275 -0.0045247 -0.2694353 -1.2101234 -0.0181864 -0.0068418 -0.0204161 -0.3517829 -0.6835172 -0.4823346 -0.0049715 -0.6035143 -0.7734619 0.0100155 -0.0087083 0.0059691 -0.394036 -0.9486624 0.3145928 0.031956 0.2767333 -0.8605899 -0.0263628 0.031023 -0.0280929 -0.3488223 -0.2837856 -0.6327553 -0.0197816 0.2909459 -0.6059725 -0.0202498 0.0066576 0.011838 -0.2767749 -0.806019 0.1706505 0.0324363 -0.4786867 -0.5493369 0.0014565 0.0125438 -0.0221392 -0.0582558 0.5713638 0.49461 0.0046834 0.4000452 1.4265318 0.0253418 0.0015654 0.0223209 0.2216191 0.72929 0.031544 -0.0255902 0.383151 0.1981803 -0.0071101 -0.0149311 0.0060847 -0.0169829 -0.7401588 0.1441136 0.0213607 0.4429595 -0.1652239 -0.0136526 0.0301971 -0.0030663 -0.2530391 0.0821899 0.1374264 0.0009022 -0.6870752 0.7000587 0.0450587 -0.0225503 0.0160463 -0.0024715 1.994368 -0.0185883 -0.0647881 0.1171387 1.2627796 0.0283997 -0.0609172 0.0329526 0.2426447 0.121573 0.0730251 0.0030722 0.0437826 0.0379186 -0.004843 0.0020067 -0.005859 0.1459781 0.2032902 -0.0603445 0.0026438 -0.0312355 0.1826122 -0.003381 0.0037716 -0.0030411 0.3304016 0.0334923 -0.0630658 0.0038986 -0.0768623 -0.0019859 -0.0028367 0.0036336 -0.0032686 0.1907686 -0.0568801 -0.0088463 0.0079748 0.0032296 0.0856865 -0.002813 0.008496 -0.0021057 0.1770374 0.1838316 0.0903 0.0107282 0.1888234 0.2729267 -0.0108368 0.014054 -0.0072227 0.3937159 unknown
polarizability: 116.7963174|4.1301346|96.4106671|-2.9053002|1.8152385|32.879202 unknown
InChI: InChI=1S/C6H5NO3/c8-5-4(6(9)10)2-1-3-7-5/h1-3,7,9H
charge 0 multiplicity 1
15 atoms
O  -0.025665 -2.27072 -0.008553
O  -2.454325 -0.901211 0.124503
O  -2.393155 1.412123 0.195991
N  1.861863 -0.919401 -0.02941
C  -0.293398 0.197259 0.080152
C  0.420235 -1.090824 0.014178
C  0.415402 1.408183 0.091002
C  1.837616 1.468833 0.041242
C  2.54188 0.270318 -0.019079
C  -1.776052 0.313303 0.137923
H  -0.17673 2.329332 0.140597
H  2.366319 -1.811969 -0.074024
H  2.36943 2.421334 0.04952
H  3.634334 0.22224 -0.059038
H  -3.431252 -0.707198 0.167096
