program: Orca
programVersion: 4.2.1
elementType: S O O O O O O O N N N N N C C C C C C C C C C C C C C C H H H H H H H H H H H H H H H H H H H
charge: 0
multiplicity: 1
keywords: wb97x-d3
keywords: def2-TZVPP
keywords: def2/J RIJCOSX GRIDX6 NOFINALGRIDX
keywords: grid4 nofinalgrid
keywords: scfconv7
keywords: smallprint printgap noloewdin
keywords: NOSOSCF
formula: C15H19N5O7S
InChI: InChI=1S/C15H19N5O7S/c1-24-8-9-27-10-6-4-5-7-11(10)28(22,23)20-13(21)16-12-17-14(25-2)19-15(18-12)26-3/h4-7,16,20H,8-9H2,1-3H3
47 atoms
S  -2.242139 -1.520144 -0.193479
O  -1.738356 0.976275 1.274848
O  -1.985971 -1.980218 1.154439
O  -2.790288 -2.414745 -1.183277
O  0.954783 1.960421 1.33704
O  -1.351373 0.00057 -2.660885
O  2.988829 -1.790578 1.543679
O  5.270604 0.489496 -1.586964
N  -0.744535 -0.973266 -0.6930
N  0.827799 0.044366 -2.068213
N  3.07393 0.288276 -1.829316
N  1.852052 -0.9105 -0.213019
N  4.177496 -0.681996 0.022304
C  -3.250285 -0.068262 -0.166364
C  -2.910616 1.029482 0.63392
C  -4.417359 -0.073583 -0.910728
C  -3.791495 2.105438 0.692771
C  -1.312147 2.089214 2.027974
C  -5.284033 1.00496 -0.851417
C  -4.96667 2.082566 -0.043694
C  0.118078 1.875469 2.451853
C  -0.511501 -0.30363 -1.856926
C  1.950326 -0.20276 -1.338311
C  2.311242 2.002676 1.676269
C  2.992722 -1.113458 0.419829
C  4.148463 0.009411 -1.104724
C  1.748577 -2.292215 2.030272
C  6.473089 0.239544 -0.873046
H  -4.641332 -0.923282 -1.539361
H  -3.577219 2.967572 1.308024
H  0.037847 -1.119225 -0.05165
H  -1.937492 2.210796 2.920253
H  -1.376443 3.011084 1.439194
H  -6.194909 1.000769 -1.432743
H  -5.636976 2.929826 0.016376
H  0.359311 2.654812 3.191223
H  0.220218 0.908773 2.967847
H  0.983057 0.573286 -2.914197
H  2.88286 2.099319 0.754273
H  2.549285 2.863215 2.315442
H  2.644324 1.099147 2.201999
H  1.986122 -2.811562 2.95406
H  1.290498 -2.991687 1.330889
H  1.03778 -1.491035 2.238352
H  7.258558 0.720432 -1.44928
H  6.678817 -0.827364 -0.790357
H  6.441779 0.664193 0.130353
totalener: -1781.72108601 hartree
nucrepener: 3118.27829637 hartree
electener: -4899.99938238 hartree
oneelecener: -8642.76403868 hartree
twoeener: 3742.76465630 hartree
kineticenergy: 1775.36557876 hartree
xcener: -146.593748001526 hartree
chargesum: -0.0000000
charge: 0.853405 -0.279032 -0.468177 -0.441956 -0.306760 -0.359426 -0.241125 -0.238614 -0.200269 -0.148619 -0.339264 -0.405771 -0.339222 -0.196498 0.375402 -0.030292 -0.217319 0.008086 -0.159362 -0.114139 -0.012766 0.328078 0.375366 -0.156345 0.349213 0.390172 -0.130939 -0.124641 0.140068 0.114604 0.195385 0.095653 0.089861 0.129354 0.129049 0.076718 0.080924 0.171214 0.114518 0.105735 0.093937 0.128550 0.122920 0.096920 0.124079 0.113006 0.108320
qa: 0.8534 -0.2790 -0.4682 -0.4420 -0.3068 -0.3594 -0.2411 -0.2386 -0.2003 -0.1486 -0.3393 -0.4058 -0.3392 -0.1965 0.3754 -0.0303 -0.2173 0.0081 -0.1594 -0.1141 -0.0128 0.3281 0.3754 -0.1563 0.3492 0.3902 -0.1309 -0.1246 0.1401 0.1146 0.1954 0.0957 0.0899 0.1294 0.1290 0.0767 0.0809 0.1712 0.1145 0.1057 0.0939 0.1285 0.1229 0.0969 0.1241 0.1130 0.1083
va: 5.8570 2.1268 2.0241 2.0638 1.9615 2.1611 2.1542 2.1581 3.0878 3.1881 2.9613 2.9136 2.9203 3.9323 3.8117 3.9515 3.9493 3.9117 3.9830 4.0018 4.0141 4.4300 4.1879 3.9454 4.2950 4.2701 3.8806 3.8714 1.0212 1.0151 1.0697 0.9903 0.9986 1.0008 0.9986 0.9994 0.9878 1.0341 0.9917 0.9952 0.9798 0.9976 0.9977 0.9879 0.9931 0.9982 0.9979
dispcorr: -0.027936828 hartree
energy: -1781.749022839714
dipole: 10.07222 -8.81785 1.25437 13.11771 -11.32624 1.79147 15.72805 -14.04881 1.67924
magnitude: 2.75730 au
magnitude: 7.00849 debye
