program: Orca
programVersion: 4.2.1
elementType: S O O O O O O O N N N N N C C C C C C C C C C C C C C C H H H H H H H H H H H H H H H H H H H
charge: 0
multiplicity: 1
keywords: wb97x-d3
keywords: def2-TZVPP
keywords: def2/J RIJCOSX GRIDX6 NOFINALGRIDX
keywords: grid4 nofinalgrid
keywords: scfconv7
keywords: smallprint printgap noloewdin
keywords: NOSOSCF
formula: C15H19N5O7S
InChI: InChI=1S/C15H19N5O7S/c1-24-8-9-27-10-6-4-5-7-11(10)28(22,23)20-13(21)16-12-17-14(25-2)19-15(18-12)26-3/h4-7,16,20H,8-9H2,1-3H3
47 atoms
S  -2.397152 -1.726922 -0.187911
O  -1.328863 0.542638 1.346696
O  -2.092366 -2.236015 1.130599
O  -3.216734 -2.48341 -1.099718
O  1.514191 1.852188 1.316653
O  -1.564781 -0.495739 -2.817345
O  2.724787 -1.449904 1.67375
O  4.82443 1.002436 -1.453567
N  -0.887937 -1.460461 -0.863104
N  0.613941 -0.344337 -2.247494
N  2.74827 0.335738 -1.863351
N  1.640502 -0.994288 -0.268479
N  3.818741 -0.235502 0.16347
C  -3.06652 -0.088996 -0.087823
C  -2.449563 0.893451 0.699307
C  -4.213967 0.190869 -0.809979
C  -3.024492 2.16113 0.740504
C  -0.719746 1.450261 2.244527
C  -4.786747 1.450099 -0.746947
C  -4.185516 2.425011 0.028387
C  0.251298 2.408164 1.561567
C  -0.701493 -0.763474 -2.025311
C  1.702605 -0.337021 -1.424287
C  2.373698 1.905552 2.425775
C  2.713535 -0.882082 0.491238
C  3.77395 0.342649 -1.024508
C  1.570672 -2.169749 2.093077
C  5.971317 1.061388 -0.619516
H  -4.652243 -0.581193 -1.425784
H  -2.579106 2.960413 1.315672
H  -0.085613 -1.544671 -0.23197
H  -0.193237 0.828878 2.971219
H  -1.477007 2.005947 2.805873
H  -5.68365 1.666783 -1.309194
H  -4.613984 3.417275 0.079079
H  -0.15415 2.725728 0.597233
H  0.339623 3.312018 2.182369
H  0.736667 0.167902 -3.10906
H  2.018586 1.309838 3.275726
H  3.33759 1.50431 2.119889
H  2.517945 2.935986 2.774658
H  1.373882 -3.026331 1.44786
H  0.680432 -1.540613 2.119935
H  1.795127 -2.522702 3.095617
H  5.756674 1.559003 0.326476
H  6.706297 1.637335 -1.174996
H  6.367765 0.068836 -0.406103
totalener: -1781.71657589 hartree
nucrepener: 3166.47788022 hartree
electener: -4948.19445612 hartree
oneelecener: -8739.07794191 hartree
twoeener: 3790.88348579 hartree
kineticenergy: 1775.35313875 hartree
xcener: -146.592828944258 hartree
chargesum: -0.0000000
charge: 0.861055 -0.285227 -0.463977 -0.435078 -0.322783 -0.353272 -0.243934 -0.238652 -0.215780 -0.160207 -0.343719 -0.407258 -0.374815 -0.222012 0.369687 -0.023074 -0.220702 -0.035800 -0.156120 -0.120196 0.011017 0.318482 0.375367 -0.116838 0.377229 0.428714 -0.132066 -0.124108 0.141345 0.112457 0.200449 0.104887 0.103026 0.130397 0.130346 0.109625 0.074688 0.172834 0.084807 0.106641 0.096261 0.124406 0.093922 0.128068 0.103273 0.124011 0.112621
qa: 0.8611 -0.2852 -0.4640 -0.4351 -0.3228 -0.3533 -0.2439 -0.2387 -0.2158 -0.1602 -0.3437 -0.4073 -0.3748 -0.2220 0.3697 -0.0231 -0.2207 -0.0358 -0.1561 -0.1202 0.0110 0.3185 0.3754 -0.1168 0.3772 0.4287 -0.1321 -0.1241 0.1413 0.1125 0.2004 0.1049 0.1030 0.1304 0.1303 0.1096 0.0747 0.1728 0.0848 0.1066 0.0963 0.1244 0.0939 0.1281 0.1033 0.1240 0.1126
va: 5.8622 2.0983 2.0308 2.0722 1.9628 2.1623 2.1489 2.1601 3.0706 3.1777 2.9802 2.9283 2.9038 3.9480 3.7926 3.9532 3.9390 3.8582 3.9820 4.0069 3.8698 4.4234 4.2069 3.9062 4.2868 4.2473 3.8713 3.8858 1.0212 1.0139 1.0755 1.0004 1.0107 1.0004 0.9981 1.0035 1.0047 1.0330 0.9843 1.0040 0.9978 0.9962 0.9941 0.9968 0.9917 0.9938 0.9972
dispcorr: -0.029583388 hartree
energy: -1781.746159281483
dipole: 11.44284 -10.02685 1.41599 16.16385 -13.98885 2.17499 17.02331 -15.27157 1.75174
magnitude: 3.13117 au
magnitude: 7.95880 debye
