program: Orca
programVersion: 4.2.1
elementType: S O O O O O O O N N N N N C C C C C C C C C C C C C C C H H H H H H H H H H H H H H H H H H H
charge: 0
multiplicity: 1
keywords: wb97x-d3
keywords: def2-TZVPP
keywords: def2/J RIJCOSX GRIDX6 NOFINALGRIDX
keywords: grid4 nofinalgrid
keywords: scfconv7
keywords: smallprint printgap noloewdin
keywords: NOSOSCF
formula: C15H19N5O7S
InChI: InChI=1S/C15H19N5O7S/c1-24-8-9-27-10-6-4-5-7-11(10)28(22,23)20-13(21)16-12-17-14(25-2)19-15(18-12)26-3/h4-7,16,20H,8-9H2,1-3H3
47 atoms
S  -2.30979 -1.549981 -0.28259
O  -1.328208 1.038138 0.789102
O  -1.992937 -1.957108 1.070122
O  -3.046144 -2.424708 -1.161162
O  1.130748 0.738632 2.184165
O  -1.470353 -0.152773 -2.839687
O  2.909355 -1.806572 1.375027
O  4.979602 1.046607 -1.411061
N  -0.809245 -1.218737 -0.936422
N  0.715363 -0.082266 -2.271599
N  2.877336 0.490934 -1.855483
N  1.765794 -1.003717 -0.415937
N  3.983219 -0.385297 0.041876
C  -3.153757 0.007874 -0.251341
C  -2.599058 1.13185 0.373302
C  -4.433503 0.049501 -0.777554
C  -3.378124 2.278546 0.491569
C  -0.710169 2.16193 1.374735
C  -5.198049 1.198928 -0.664081
C  -4.667174 2.301505 -0.020226
C  0.778362 1.896325 1.493673
C  -0.61014 -0.480822 -2.066721
C  1.822774 -0.209583 -1.481216
C  0.807068 0.74085 3.548845
C  2.869461 -1.045735 0.313208
C  3.924499 0.353744 -1.050795
C  1.749827 -2.558212 1.719702
C  6.14471 0.966411 -0.602297
H  -4.828079 -0.822445 -1.278977
H  -2.99551 3.163005 0.980366
H  -0.006809 -1.361077 -0.31527
H  -1.164685 2.381639 2.348248
H  -0.831482 3.054417 0.748862
H  -6.196706 1.227399 -1.07552
H  -5.255024 3.203713 0.084495
H  1.205654 1.805186 0.492631
H  1.226845 2.791895 1.951467
H  0.843494 0.499687 -3.086568
H  1.174837 1.641191 4.058006
H  -0.269673 0.655684 3.730827
H  1.291882 -0.123829 3.99923
H  0.888786 -1.916169 1.900096
H  2.0079 -3.087203 2.632792
H  1.498258 -3.282912 0.944672
H  6.528661 -0.05202 -0.548583
H  5.955989 1.318148 0.411824
H  6.877177 1.609076 -1.082826
totalener: -1781.71807905 hartree
nucrepener: 3151.93306771 hartree
electener: -4933.65114675 hartree
oneelecener: -8710.12520169 hartree
twoeener: 3776.47405494 hartree
kineticenergy: 1775.35856353 hartree
xcener: -146.593955356776 hartree
chargesum: 0.0000000
charge: 0.858734 -0.275598 -0.467497 -0.441978 -0.313700 -0.353815 -0.235996 -0.239836 -0.200923 -0.153801 -0.340590 -0.404075 -0.341259 -0.191621 0.389042 -0.045822 -0.222181 -0.037593 -0.161628 -0.114934 -0.016944 0.310523 0.316053 -0.126022 0.396744 0.403329 -0.145868 -0.124574 0.142824 0.113908 0.199208 0.108711 0.104409 0.130143 0.129912 0.088074 0.090925 0.172733 0.091731 0.103894 0.102274 0.104456 0.127947 0.125817 0.112232 0.110052 0.122581
qa: 0.8587 -0.2756 -0.4675 -0.4420 -0.3137 -0.3538 -0.2360 -0.2398 -0.2009 -0.1538 -0.3406 -0.4041 -0.3413 -0.1916 0.3890 -0.0458 -0.2222 -0.0376 -0.1616 -0.1149 -0.0169 0.3105 0.3161 -0.1260 0.3967 0.4033 -0.1459 -0.1246 0.1428 0.1139 0.1992 0.1087 0.1044 0.1301 0.1299 0.0881 0.0909 0.1727 0.0917 0.1039 0.1023 0.1045 0.1279 0.1258 0.1122 0.1101 0.1226
va: 5.8394 2.1149 2.0221 2.0614 1.9568 2.1618 2.1584 2.1571 3.0757 3.1666 2.9502 2.9082 2.9359 3.9124 3.7899 3.9690 3.9551 3.8506 3.9936 4.0040 3.9994 4.4381 4.2354 3.9266 4.2806 4.2617 3.8614 3.8713 1.0211 1.0167 1.0767 0.9819 0.9947 1.0009 0.9985 0.9911 1.0012 1.0331 0.9931 0.9783 0.9955 0.9968 0.9955 0.9954 0.9984 0.9983 0.9931
dispcorr: -0.028805978 hartree
energy: -1781.746885025348
dipole: 7.91750 -6.79251 1.12499 12.69660 -10.61749 2.07911 17.53176 -15.98812 1.54364
magnitude: 2.82331 au
magnitude: 7.17629 debye
