program: Orca
programVersion: 4.2.1
elementType: S O O O O O O O N N N N N C C C C C C C C C C C C C C C H H H H H H H H H H H H H H H H H H H
charge: 0
multiplicity: 1
keywords: wb97x-d3
keywords: def2-TZVPP
keywords: def2/J RIJCOSX GRIDX6 NOFINALGRIDX
keywords: grid4 nofinalgrid
keywords: scfconv7
keywords: smallprint printgap noloewdin
keywords: NOSOSCF
formula: C15H19N5O7S
InChI: InChI=1S/C15H19N5O7S/c1-24-8-9-27-10-6-4-5-7-11(10)28(22,23)20-13(21)16-12-17-14(25-2)19-15(18-12)26-3/h4-7,16,20H,8-9H2,1-3H3
47 atoms
S  -2.183822 -1.499588 -0.212994
O  -0.993739 0.973679 0.80429
O  -1.891604 -1.850109 1.161159
O  -2.997049 -2.360553 -1.032693
O  -0.22856 1.288706 3.675207
O  -1.306324 -0.580588 -2.948337
O  3.018014 -1.146876 1.608053
O  5.262782 0.395517 -1.963025
N  -0.664356 -1.332164 -0.893024
N  0.884012 -0.485015 -2.409503
N  3.100153 -0.04203 -2.196909
N  1.890761 -0.850352 -0.343798
N  4.183019 -0.383901 -0.124557
C  -2.871061 0.13166 -0.290284
C  -2.206484 1.219155 0.292063
C  -4.099559 0.29362 -0.907511
C  -2.82312 2.466082 0.263703
C  -0.20249 2.011674 1.349421
C  -4.704325 1.539312 -0.932405
C  -4.062198 2.613888 -0.342573
C  -0.523901 2.333808 2.798452
C  -0.451914 -0.792571 -2.131077
C  1.993629 -0.464037 -1.615681
C  -1.296135 0.413695 3.959446
C  3.017129 -0.788752 0.349673
C  4.15828 -0.026728 -1.396651
C  1.798973 -1.581736 2.205115
C  6.445994 0.450142 -1.177456
H  -4.57501 -0.557067 -1.374503
H  -2.352882 3.332951 0.705738
H  0.122462 -1.336002 -0.23854
H  -0.261634 2.91907 0.737644
H  0.823524 1.647001 1.282742
H  -5.663528 1.666508 -1.413329
H  -4.524178 3.592224 -0.353612
H  0.105499 3.186026 3.077444
H  -1.5669 2.665173 2.901958
H  1.036124 -0.148096 -3.349365
H  -0.981455 -0.216239 4.790808
H  -2.193138 0.961187 4.273844
H  -1.56232 -0.231698 3.120145
H  2.058045 -1.856773 3.223095
H  1.382502 -2.44806 1.691201
H  1.054672 -0.786572 2.230005
H  7.219608 0.821913 -1.843391
H  6.725614 -0.533806 -0.80188
H  6.334932 1.125677 -0.32952
totalener: -1781.71844277 hartree
nucrepener: 3109.38304626 hartree
electener: -4891.10148903 hartree
oneelecener: -8624.49865758 hartree
twoeener: 3733.39716856 hartree
kineticenergy: 1775.35504237 hartree
xcener: -146.592221198293 hartree
chargesum: -0.0000000
charge: 0.872223 -0.296277 -0.476890 -0.434020 -0.335457 -0.348026 -0.237657 -0.238001 -0.206882 -0.157225 -0.343195 -0.436779 -0.349278 -0.183871 0.363285 -0.028388 -0.226903 -0.043443 -0.160422 -0.121058 0.012494 0.314116 0.367619 -0.127767 0.378486 0.404024 -0.092656 -0.122160 0.141922 0.109563 0.201644 0.106675 0.106728 0.131237 0.131034 0.094591 0.075104 0.174224 0.112352 0.085643 0.120104 0.127576 0.115470 0.073889 0.123070 0.112604 0.110680
qa: 0.8722 -0.2963 -0.4769 -0.4340 -0.3355 -0.3480 -0.2377 -0.2380 -0.2069 -0.1572 -0.3432 -0.4368 -0.3493 -0.1839 0.3633 -0.0284 -0.2269 -0.0434 -0.1604 -0.1211 0.0125 0.3141 0.3676 -0.1278 0.3785 0.4040 -0.0927 -0.1222 0.1419 0.1096 0.2016 0.1067 0.1067 0.1312 0.1310 0.0946 0.0751 0.1742 0.1124 0.0856 0.1201 0.1276 0.1155 0.0739 0.1231 0.1126 0.1107
va: 5.8237 2.0545 2.0035 2.0725 1.9488 2.1664 2.1709 2.1610 3.0801 3.1761 2.9813 2.9298 2.9510 3.9360 3.7596 3.9655 3.9675 3.8266 3.9863 4.0040 3.9586 4.4344 4.2093 3.8720 4.3018 4.2736 3.8698 3.8676 1.0207 1.0198 1.0700 1.0093 1.0009 1.0008 0.9979 1.0041 1.0009 1.0318 0.9938 0.9996 0.9886 0.9996 0.9967 1.0020 0.9933 0.9982 0.9982
dispcorr: -0.028191889 hartree
energy: -1781.746634654910
dipole: 2.74020 -1.73765 1.00255 13.44980 -11.42232 2.02748 18.14177 -17.22705 0.91471
magnitude: 2.43977 au
magnitude: 6.20140 debye
