program: Orca
programVersion: 4.2.1
elementType: S O O O O O O O N N N N N C C C C C C C C C C C C C C C H H H H H H H H H H H H H H H H H H H
charge: 0
multiplicity: 1
keywords: wb97x-d3
keywords: def2-TZVPP
keywords: def2/J RIJCOSX GRIDX6 NOFINALGRIDX
keywords: grid4 nofinalgrid
keywords: scfconv7
keywords: smallprint printgap noloewdin
keywords: NOSOSCF
formula: C15H19N5O7S
InChI: InChI=1S/C15H19N5O7S/c1-24-8-9-27-10-6-4-5-7-11(10)28(22,23)20-13(21)16-12-17-14(25-2)19-15(18-12)26-3/h4-7,16,20H,8-9H2,1-3H3
47 atoms
S  -2.321932 -1.607409 0.27226
O  -1.501898 0.898638 -1.071481
O  -2.973799 -2.447201 1.246403
O  -2.10827 -2.076066 -1.081034
O  1.307704 1.698728 -0.894806
O  -1.293334 -0.090602 2.689797
O  2.759254 -1.943538 -1.764868
O  5.110591 0.811071 0.894912
N  -0.779197 -1.232122 0.785512
N  0.856081 -0.113401 1.992508
N  3.013817 0.349888 1.45621
N  1.764416 -1.11324 0.100038
N  3.976813 -0.590206 -0.485756
C  -3.183164 -0.060658 0.239853
C  -2.714603 1.020637 -0.517015
C  -4.393126 0.012381 0.908345
C  -3.515331 2.153974 -0.621821
C  -0.952337 1.979992 -1.790968
C  -5.176088 1.150771 0.811049
C  -4.735358 2.20833 0.036334
C  0.513667 1.693379 -2.046212
C  -0.49081 -0.467728 1.877693
C  1.908587 -0.300384 1.144535
C  1.601858 2.972904 -0.386429
C  2.820837 -1.198025 -0.687142
C  4.007871 0.160995 0.599471
C  1.552361 -2.644148 -2.04137
C  6.229162 0.663207 0.032288
H  -4.718897 -0.825914 1.507081
H  -3.206371 3.00106 -1.217316
H  -0.019386 -1.426398 0.126713
H  -1.064338 2.9174 -1.234716
H  -1.467423 2.10506 -2.751028
H  -6.120381 1.204957 1.333546
H  -5.341999 3.09904 -0.060166
H  0.615593 0.705708 -2.501624
H  0.873727 2.427015 -2.782518
H  1.053103 0.4853 2.780996
H  0.717371 3.50423 -0.016733
H  2.283445 2.839091 0.451605
H  2.091287 3.608018 -1.135389
H  0.709001 -1.968693 -2.192154
H  1.299798 -3.344966 -1.245249
H  1.738151 -3.194732 -2.958992
H  6.562344 -0.373044 -0.02171
H  7.013999 1.277305 0.465457
H  6.007775 1.00777 -0.977715
totalener: -1781.71995486 hartree
nucrepener: 3159.69191683 hartree
electener: -4941.41187168 hartree
oneelecener: -8725.75896245 hartree
twoeener: 3784.34709077 hartree
kineticenergy: 1775.36720269 hartree
xcener: -146.597150321758 hartree
chargesum: 0.0000000
charge: 0.856627 -0.277039 -0.442162 -0.469551 -0.315656 -0.358923 -0.240962 -0.244920 -0.196188 -0.141805 -0.370043 -0.420794 -0.344529 -0.191259 0.381077 -0.040756 -0.221582 0.002266 -0.161864 -0.113349 -0.026970 0.315547 0.372575 -0.113206 0.385418 0.420275 -0.127762 -0.124897 0.142219 0.113569 0.188779 0.077664 0.106616 0.130198 0.129378 0.092493 0.083901 0.168568 0.093649 0.105722 0.092314 0.095203 0.118765 0.127465 0.112588 0.121947 0.109390
qa: 0.8566 -0.2770 -0.4422 -0.4696 -0.3157 -0.3589 -0.2410 -0.2449 -0.1962 -0.1418 -0.3700 -0.4208 -0.3445 -0.1913 0.3811 -0.0408 -0.2216 0.0023 -0.1619 -0.1133 -0.0270 0.3155 0.3726 -0.1132 0.3854 0.4203 -0.1278 -0.1249 0.1422 0.1136 0.1888 0.0777 0.1066 0.1302 0.1294 0.0925 0.0839 0.1686 0.0936 0.1057 0.0923 0.0952 0.1188 0.1275 0.1126 0.1219 0.1094
va: 5.8468 2.1168 2.0610 2.0208 1.9631 2.1586 2.1577 2.1508 3.0723 3.1793 2.9315 2.9253 2.9375 3.9209 3.8088 3.9668 3.9514 3.8346 3.9883 4.0011 3.9853 4.4361 4.2095 3.9098 4.2985 4.2375 3.8762 3.8717 1.0212 1.0145 1.0871 0.9868 0.9957 1.0008 0.9984 0.9950 1.0054 1.0360 0.9825 1.0038 0.9947 0.9964 0.9941 0.9971 0.9984 0.9931 0.9981
dispcorr: -0.029016493 hartree
energy: -1781.748971348853
dipole: 8.56999 -7.46175 1.10824 16.42534 -14.23298 2.19236 -12.56220 11.04427 -1.51793
magnitude: 2.88769 au
magnitude: 7.33993 debye
