program: Gaussian 09
title: 000069111
version: EM64L-G09RevD.01
frameworkgroup: C1[X(C7H6ClNO)]
method: RPBEPBE
basis: SDD
operation: Freq
keyword: #p
keyword: freq=noraman
keyword: PBEPBE/SDD
title: #p freq=noraman PBEPBE/SDD
converged: YES YES NO NO
title: Mulliken charges:
elementType: Cl O N C C C C C C C H H H H H H
charge: -0.077947 -0.283545 -0.623259 0.331724 -0.233782 -0.323431 -0.216311 -0.229188 -0.214922 0.178766 0.292717 0.259924 0.240208 0.241040 0.320809 0.337197
chargesum: 0.00000
title: Mulliken charges with hydrogens summed into heavy atoms:
elementType: Cl O N C C C C C C C
charge: -0.077947 -0.283545 0.034747 0.331724 -0.233782 -0.030714 0.043613 0.011019 0.026118 0.178766
polarizability: 1.22862482e+02 -5.86595018e+00 1.13421141e+02 -6.15769745e-02 1.29375314e-01 3.67061013e+01
1716.lowfreq: -10.1833 -0.0033 -0.0031 -0.0022 1.4576 7.1077 21.8788 113.9968 210.7712
frequency: 21.2732 113.9953 210.7711 233.2937 286.2473 336.9355 425.2164 425.9151 479.8210 499.7026 569.5599 591.2863 604.7055 650.7572 685.1147 748.0122 750.9501 783.4798 884.7848 973.7494 1002.0858 1010.3593 1035.4641 1075.4909 1112.0380 1138.6483 1172.0195 1254.8601 1355.5977 1370.0457 1419.0622 1452.5223 1555.5958 1581.2637 1605.1424 1630.9099 3141.2148 3152.2072 3165.5836 3178.0245 3493.5054 3653.5109
redmass: 5.9310 4.5793 5.1217 12.7614 5.5251 7.3237 8.5220 3.1128 3.3555 4.7211 1.1702 4.3724 1.3770 6.2862 3.0289 2.3618 5.0922 1.7057 1.3835 1.3598 7.4102 1.3449 2.6419 1.8610 2.2894 1.7311 1.0584 1.4265 4.2156 5.1487 2.4523 2.4629 4.7375 2.6963 5.5747 1.9731 1.0861 1.0903 1.0951 1.1002 1.0462 1.1037
irintensity: 12.0920 0.0119 1.8118 6.1047 9.6819 5.5584 11.7885 5.3630 4.7375 3.8796 81.6924 9.3640 147.5892 10.6249 59.3754 77.0925 14.6792 32.0395 0.9170 2.8558 49.3639 1.7232 9.7478 0.8030 2.2431 1.2270 1.9594 3.6536 143.3245 49.6190 59.3476 13.5882 43.6019 131.1655 7.6708 264.3862 5.3173 1.3386 9.1105 14.6489 46.1492 92.0699
temp: 298.150 k
press: 1.00000 atm
elementType: 17 8 7 6 6 6 6 6 6 6 1 1 1 1 1 1
symmnumber: 1
zpe: 304035.2 jmol-1
zpe.correction: 0.115801 hartree
zpe.thermalcorrener: 0.124516 hartree
zpe.thermalcorrenthalpy: 0.125460 hartree
zpe.thermalcorrgfe: 0.080636 hartree
zpe.sumelectzpe: -859.683677 hartree
zpe.sumelectthermal: -859.674962 hartree
zpe.sumelectthermalent: -859.674018 hartree
zpe.sumelectthermalfe: -859.718842 hartree
dipole: 1.8038 2.1901 0.0955
dipole: 2.8389
quadrupole: -51.6843 -69.2130 -68.3832
quadrupole: -8.3913 -0.2234 -0.0884
quadrupole: 11.4092 -6.1195 -5.2897 -8.3913 -0.2234 -0.0884
hfenergy: -859.7994779 hartree
pointgroup: C01 [X(C7H6Cl1N1O1)]
dipole: -0.74777 -0.813621 0.1622967 debye
dipolederiv: -0.3321351 0.2400544 -0.1053177 0.2012439 -0.6005826 0.1773583 -0.0969521 0.182265 -0.1336951 -0.763609 -0.280904 0.0277887 -0.1023945 -0.9243972 0.1569607 -0.0281683 0.1269086 -0.4202493 -0.8438573 0.3535495 -0.1377946 0.2862919 -0.690551 0.0474588 -0.1180094 0.0597032 -0.7164348 -0.5158297 0.0091755 -0.084589 -0.1205391 -0.2799096 0.0788144 -0.0453549 0.0982842 0.0208361 0.4161938 -0.4515398 0.1951661 -0.189625 0.8342773 -0.2790684 0.1196027 -0.3187121 0.03725 0.0156589 0.025459 0.010475 -0.0394888 -0.0269735 -0.0276456 0.0317523 -0.019836 -0.0973473 -0.2664971 0.166683 -0.0702711 0.1680748 -0.1449098 0.0355243 -0.0711983 0.0361167 -0.1233534 -0.0541241 -0.1622386 0.0605973 -0.1110235 0.0152152 -0.0649022 0.0457675 -0.0723485 -0.1314573 0.123801 0.0482458 0.0237574 -0.0519923 0.0773937 -0.0677864 0.0522956 -0.0532879 -0.1155202 1.5270362 0.0701052 0.175535 -0.0845974 1.2174243 -0.3216598 0.2210354 -0.2929283 0.3661871 0.1573724 -0.0300516 0.0080623 -0.0063362 0.0465262 0.0299159 0.000051 0.0274916 0.1501989 0.0727919 -0.0434782 -0.001117 -0.0629652 -0.0095189 0.040816 0.0039948 0.0432575 0.1563268 0.0230795 0.0746632 -0.0411423 0.087085 -0.0173796 0.0635756 -0.0445478 0.0615687 0.1403053 -0.097619 -0.017335 -0.0321896 -0.0212192 0.0867502 0.0180045 -0.0313199 0.0186095 0.1521506 0.3365104 0.0430348 -0.0158161 0.0842445 0.2383336 0.0558566 -0.0250058 0.0477403 0.3528245 0.2012272 -0.0454231 -0.0131442 -0.0367589 0.178302 0.0567772 -0.0139429 0.0551676 0.3619781 unknown
polarizability: 120.6384923|-2.7587716|107.8200413|13.0045533|-20.7418639|44.5311905 unknown
InChI: InChI=1S/C7H6ClNO/c8-6-4-2-1-3-5(6)7(9)10/h1-4H,9H2
charge 0 multiplicity 1
16 atoms
Cl 0.428611 -2.337006 1.012825
O  2.094587 1.958605 0.015349
N  2.601048 -0.165339 0.750676
C  0.225319 0.427846 0.208165
C  -0.439755 -0.800045 0.458615
C  -0.600002 1.51038 -0.215541
C  -1.832233 -0.958113 0.303427
C  -1.990304 1.38043 -0.377455
C  -2.613711 0.138725 -0.11664
C  1.704205 0.786589 0.318568
H  -0.081685 2.455463 -0.409524
H  -2.294453 -1.927601 0.509298
H  -2.584417 2.239575 -0.704533
H  -3.695174 0.016502 -0.236843
H  2.328449 -1.115548 1.001659
H  3.578213 0.120139 0.809454
