program: Gaussian 09
title: 000007595
version: EM64L-G09RevD.01
frameworkgroup: C1[X(C13H12N2O)]
method: RPBEPBE
basis: SDD
operation: Freq
keyword: #p
keyword: freq=noraman
keyword: PBEPBE/SDD
title: #p freq=noraman PBEPBE/SDD
converged: NO YES YES YES
title: Mulliken charges:
elementType: O N N C C C C C C C C C C C C C H H H H H H H H H H H H
charge: -0.283167 -0.505435 -0.505380 0.475492 0.475465 0.275547 -0.447861 -0.447837 -0.333619 -0.333554 -0.197638 -0.197655 -0.213818 -0.213937 -0.258802 -0.258713 0.287194 0.287236 0.212341 0.212365 0.306345 0.306401 0.225179 0.225196 0.225712 0.225739 0.228611 0.228593
chargesum: 0.00000
title: Mulliken charges with hydrogens summed into heavy atoms:
elementType: O N N C C C C C C C C C C C C C
charge: -0.283167 -0.218241 -0.218143 0.475492 0.475465 0.275547 -0.235520 -0.235471 -0.027273 -0.027153 0.027541 0.027541 0.011894 0.011802 -0.030191 -0.030120
polarizability: 2.87241831e+02 -1.51926848e-03 1.57837345e+02 -1.26562153e-04 4.29527871e-03 6.09715555e+01
1716.lowfreq: -0.0009 0.0004 0.0008 6.2112 12.3426 22.5092 33.8337 38.3870 76.8611
frequency: 33.6772 37.6894 76.8380 80.5306 83.6930 209.4147 226.5382 229.3032 231.4134 350.5761 355.8763 408.1529 408.2157 432.6282 509.7978 512.8406 529.8904 613.2666 614.5922 615.1508 630.8261 694.7942 696.9569 697.3439 760.8363 764.6749 766.4960 791.5403 839.0340 840.4739 879.4401 913.1994 914.7904 970.2217 970.5495 981.1998 983.9408 997.1474 999.1395 1000.0930 1027.3736 1033.9942 1089.4575 1092.2960 1172.1547 1172.3565 1176.9786 1189.3510 1189.4921 1247.3664 1277.7008 1317.2917 1323.0592 1382.2901 1385.6472 1425.9271 1433.8015 1484.6630 1489.2751 1512.1029 1519.2459 1599.4401 1603.1632 1616.5164 1618.3376 1654.4960 3102.3700 3102.4791 3131.5521 3131.6138 3142.7290 3142.8446 3165.1177 3165.2586 3198.0128 3198.3155 3518.8103 3531.2784
redmass: 3.6021 6.0065 6.4676 5.1829 4.3291 4.9617 2.6534 6.6312 4.0482 9.4160 5.3206 2.9410 2.9422 1.5303 2.8059 7.3001 2.5527 6.4068 1.1850 6.4514 6.5830 1.9835 11.1488 2.0089 7.1548 1.6883 1.6903 5.8070 1.2723 1.2745 5.6643 1.4243 1.4246 1.3480 1.3470 6.2187 6.1550 6.3659 1.3028 1.3001 2.1929 2.0204 1.5505 1.5706 1.0541 1.0499 2.7481 1.1130 1.1116 2.1240 2.0511 1.5879 1.4100 4.6404 6.9736 2.4145 2.4371 2.3731 2.3315 2.0495 2.1529 5.1340 5.6998 6.0824 5.7889 3.9491 1.0888 1.0888 1.0865 1.0866 1.0933 1.0933 1.0998 1.0998 1.0948 1.0947 1.0766 1.0755
irintensity: 0.0000 0.4182 9.2399 0.0052 0.0015 10.7273 0.0001 0.1074 4.1003 6.0355 0.0609 0.0084 0.0000 0.0000 54.0063 13.1271 0.0001 2.4346 100.4288 0.2030 0.3114 0.0007 12.1595 102.6315 0.0460 0.0040 194.7180 2.4608 0.0000 0.2205 0.1044 0.0119 28.9938 0.0002 0.2734 0.0127 1.5922 0.3820 0.0030 6.6821 14.3659 1.8489 1.3838 25.2517 0.0039 1.2458 290.6365 0.4596 7.6034 239.3110 11.8625 6.8925 120.9674 7.7976 198.0642 20.9816 199.1375 284.1463 2.2011 943.2781 0.1566 58.7429 36.2924 133.1583 0.0407 106.7024 19.7227 19.2792 0.0940 0.0719 19.0748 44.0345 53.6746 1.8065 14.6858 2.3042 7.3775 13.9705
temp: 298.150 k
press: 1.00000 atm
elementType: 8 7 7 6 6 6 6 6 6 6 6 6 6 6 6 6 1 1 1 1 1 1 1 1 1 1 1 1
symmnumber: 1
zpe: 581486.5 jmol-1
zpe.correction: 0.221476 hartree
zpe.thermalcorrener: 0.234865 hartree
zpe.thermalcorrenthalpy: 0.235809 hartree
zpe.thermalcorrgfe: 0.179909 hartree
zpe.sumelectzpe: -686.214915 hartree
zpe.sumelectthermal: -686.201526 hartree
zpe.sumelectthermalent: -686.200582 hartree
zpe.sumelectthermalfe: -686.256483 hartree
dipole: 0.0020 -4.0709 0.0000
dipole: 4.0709
quadrupole: -81.8430 -80.0845 -101.7618
quadrupole: -0.0016 -0.0003 0.0011
quadrupole: 6.0534 7.8119 -13.8654 -0.0016 -0.0003 0.0011
hfenergy: -686.4363915 hartree
pointgroup: C01 [X(C13H12N2O1)]
dipole: 0.000903 -1.6016038 -0.0000103 debye
polarizability: 287.241831|0.008028|157.837346|-0.0001269|0.0042953|60.9715555 unknown
InChI: InChI=1S/C13H12N2O/c16-13(14-11-7-3-1-4-8-11)15-12-9-5-2-6-10-12/h1-10,14-15H
charge 0 multiplicity 1
28 atoms
O  -0.000822 1.288641 0.000005
N  -1.167112 -0.763534 -0.000007
N  1.165165 -0.763472 -0.000013
C  -2.520503 -0.321194 0.000016
C  2.518609 -0.320942 -0.000002
C  -0.000845 0.02442 -0.000032
C  -3.526656 -1.327142 0.000064
C  3.524915 -1.32675 -0.000154
C  -2.900109 1.048188 -0.000041
C  2.897774 1.048529 0.000185
C  -4.890533 -0.973571 0.000057
C  4.888691 -0.972791 -0.000112
C  -4.271258 1.383699 -0.000035
C  4.268851 1.384429 0.000218
C  -5.274271 0.387752 0.000012
C  5.272004 0.388659 0.000079
H  -1.055746 -1.779637 0.000063
H  1.054103 -1.779616 -0.0001
H  -3.239736 -2.387727 0.000098
H  3.238254 -2.387403 -0.000313
H  -2.12722 1.818044 -0.000067
H  2.124546 1.818076 0.000281
H  -5.651425 -1.761979 0.000102
H  5.649868 -1.760908 -0.000233
H  -4.554571 2.442431 -0.000075
H  4.551937 2.443207 0.00037
H  -6.3336 0.664876 0.000011
H  6.33129 0.666013 0.000123
