program: Orca
programVersion: 4.2.1
elementType: S O O O O O O O N N N N N C C C C C C C C C C C C C C C H H H H H H H H H H H H H H H H H H H
charge: 0
multiplicity: 1
keywords: wb97x-d3
keywords: def2-TZVPP
keywords: def2/J RIJCOSX GRIDX6 NOFINALGRIDX
keywords: grid4 nofinalgrid
keywords: scfconv7
keywords: smallprint printgap noloewdin
keywords: NOSOSCF
formula: C15H19N5O7S
InChI: InChI=1S/C15H19N5O7S/c1-24-8-9-27-10-6-4-5-7-11(10)28(22,23)20-13(21)16-12-17-14(25-2)19-15(18-12)26-3/h4-7,16,20H,8-9H2,1-3H3
47 atoms
S  -2.379059 -1.640401 -0.149792
O  -1.46699 0.873644 1.081768
O  -2.060021 -2.012873 1.211176
O  -3.113638 -2.534357 -1.00867
O  1.204598 2.576799 2.705996
O  -1.536078 -0.496883 -2.828879
O  2.879785 -1.559075 1.549282
O  4.967754 0.722648 -1.710707
N  -0.872168 -1.32794 -0.813347
N  0.654258 -0.380201 -2.292827
N  2.843728 0.163329 -2.020421
N  1.717417 -1.025445 -0.328241
N  3.965135 -0.416591 -0.021597
C  -3.19134 -0.068506 -0.184431
C  -2.658238 1.03465 0.494677
C  -4.394487 0.028216 -0.862918
C  -3.374649 2.227037 0.494304
C  -0.836547 1.977723 1.698167
C  -5.101101 1.21925 -0.857484
C  -4.587211 2.307583 -0.1744
C  0.537138 1.500006 2.122513
C  -0.674964 -0.736102 -2.026291
C  1.773369 -0.420423 -1.515827
C  2.516183 2.258492 3.079939
C  2.841332 -0.992385 0.368124
C  3.903231 0.13394 -1.223181
C  1.728271 -2.256697 2.014126
C  6.149503 0.746783 -0.921829
H  -4.771245 -0.830725 -1.399295
H  -2.999795 3.099377 1.01106
H  -0.070566 -1.423113 -0.186974
H  -1.408791 2.322131 2.566446
H  -0.737896 2.814994 0.998275
H  -6.040208 1.293885 -1.386741
H  -5.129741 3.243613 -0.160744
H  0.43683 0.65709 2.822805
H  1.073572 1.12586 1.238978
H  0.778548 0.077953 -3.184365
H  3.126762 1.945343 2.223019
H  2.964462 3.149769 3.515909
H  2.55099 1.453368 3.824351
H  0.866632 -1.598856 2.131856
H  2.005108 -2.660738 2.983492
H  1.456392 -3.074364 1.346391
H  6.506552 -0.258557 -0.700008
H  5.994071 1.275199 0.018699
H  6.887023 1.27433 -1.519985
totalener: -1781.72003746 hartree
nucrepener: 3093.49937263 hartree
electener: -4875.21941009 hartree
oneelecener: -8592.46407752 hartree
twoeener: 3717.24466743 hartree
kineticenergy: 1775.35334206 hartree
xcener: -146.590719735210 hartree
chargesum: -0.0000000
charge: 0.858459 -0.292588 -0.465369 -0.436995 -0.321107 -0.351881 -0.236176 -0.235507 -0.209307 -0.157835 -0.340137 -0.437438 -0.349625 -0.206650 0.371875 -0.032624 -0.210870 0.015990 -0.155399 -0.117871 0.022465 0.322686 0.377779 -0.105099 0.363022 0.411189 -0.128971 -0.125153 0.141614 0.117874 0.194840 0.103415 0.094892 0.130735 0.131124 0.081247 0.032597 0.174837 0.075239 0.114226 0.083435 0.093659 0.131392 0.124614 0.113642 0.108911 0.124844
qa: 0.8585 -0.2926 -0.4654 -0.4370 -0.3211 -0.3519 -0.2362 -0.2355 -0.2093 -0.1578 -0.3401 -0.4374 -0.3496 -0.2067 0.3719 -0.0326 -0.2109 0.0160 -0.1554 -0.1179 0.0225 0.3227 0.3778 -0.1051 0.3630 0.4112 -0.1290 -0.1252 0.1416 0.1179 0.1948 0.1034 0.0949 0.1307 0.1311 0.0812 0.0326 0.1748 0.0752 0.1142 0.0834 0.0937 0.1314 0.1246 0.1136 0.1089 0.1248
va: 5.8485 2.1126 2.0275 2.0689 2.0026 2.1648 2.1533 2.1645 3.0748 3.1769 2.9839 2.9134 2.9251 3.9384 3.8065 3.9599 3.9546 3.8778 3.9804 4.0018 4.0339 4.4243 4.1922 3.9347 4.2863 4.2567 3.8608 3.8746 1.0208 1.0155 1.0736 0.9945 0.9968 1.0005 0.9982 0.9874 0.9969 1.0315 0.9932 0.9939 0.9910 0.9975 0.9965 0.9955 0.9975 0.9954 0.9934
dispcorr: -0.027225752 hartree
energy: -1781.747263215750
dipole: 12.64307 -11.00871 1.63436 13.53035 -12.06512 1.46524 15.96441 -14.95082 1.01359
magnitude: 2.41773 au
magnitude: 6.14538 debye
