program: Orca
programVersion: 4.2.1
elementType: S O O O O O O O N N N N N C C C C C C C C C C C C C C C H H H H H H H H H H H H H H H H H H H
charge: 0
multiplicity: 1
keywords: wb97x-d3
keywords: def2-TZVPP
keywords: def2/J RIJCOSX GRIDX6 NOFINALGRIDX
keywords: grid4 nofinalgrid
keywords: scfconv7
keywords: smallprint printgap noloewdin
keywords: NOSOSCF
formula: C15H19N5O7S
InChI: InChI=1S/C15H19N5O7S/c1-24-8-9-27-10-6-4-5-7-11(10)28(22,23)20-13(21)16-12-17-14(25-2)19-15(18-12)26-3/h4-7,16,20H,8-9H2,1-3H3
47 atoms
S  -2.368904 -1.639963 -0.278399
O  -1.474343 1.124107 -0.77387
O  -3.094719 -2.738706 0.306875
O  -2.050462 -1.628692 -1.689759
O  1.204709 3.23327 -1.801626
O  -1.520567 -1.262141 2.612009
O  2.861724 -1.059546 -1.914832
O  4.964972 0.276186 1.824778
N  -0.862636 -1.506389 0.443456
N  0.668499 -0.999696 2.120401
N  2.850589 -0.375358 1.989633
N  1.719949 -1.081349 0.048702
N  3.953695 -0.372304 -0.101654
C  -3.195245 -0.142363 0.176034
C  -2.671861 1.108017 -0.177689
C  -4.404843 -0.244134 0.842431
C  -3.405166 2.248472 0.132951
C  -0.847932 2.360648 -1.049104
C  -5.127932 0.896871 1.147439
C  -4.624182 2.133712 0.784738
C  0.543097 2.031219 -1.551219
C  -0.66241 -1.270979 1.77164
C  1.781127 -0.816121 1.354721
C  2.530933 3.042377 -2.209168
C  2.832775 -0.838878 -0.623369
C  3.900822 -0.172517 1.205306
C  1.713605 -1.625125 -2.540539
C  6.135907 0.530919 1.060493
H  -4.773472 -1.219671 1.125195
H  -3.039356 3.231443 -0.128481
H  -0.060834 -1.429946 -0.185811
H  -0.778612 2.975534 -0.144983
H  -1.406207 2.923835 -1.804842
H  -6.072319 0.81682 1.666446
H  -5.180225 3.033093 1.014064
H  1.066112 1.436839 -0.78875
H  0.473995 1.409793 -2.456607
H  0.7964 -0.79873 3.101975
H  2.974585 4.02338 -2.371256
H  3.124409 2.512287 -1.452749
H  2.599274 2.472003 -3.143769
H  1.476056 -2.606575 -2.129709
H  1.975278 -1.7282 -3.589486
H  0.835124 -0.985435 -2.4498
H  6.877005 0.881851 1.772979
H  5.963236 1.296318 0.303894
H  6.498124 -0.369981 0.566036
totalener: -1781.71987061 hartree
nucrepener: 3095.85521338 hartree
electener: -4877.57508399 hartree
oneelecener: -8597.16325508 hartree
twoeener: 3719.58817109 hartree
kineticenergy: 1775.35118299 hartree
xcener: -146.590457055213 hartree
chargesum: -0.0000000
charge: 0.859317 -0.293039 -0.437049 -0.465673 -0.321113 -0.351289 -0.236164 -0.235342 -0.210094 -0.158847 -0.339813 -0.435155 -0.348891 -0.199227 0.368352 -0.035111 -0.211957 0.018145 -0.154631 -0.118741 0.022135 0.322898 0.377231 -0.103627 0.358474 0.412421 -0.129269 -0.123507 0.141512 0.118588 0.195075 0.094956 0.102484 0.130210 0.131224 0.032580 0.080793 0.174943 0.115095 0.072205 0.084211 0.125501 0.131470 0.092545 0.124324 0.108510 0.113339
qa: 0.8593 -0.2930 -0.4370 -0.4657 -0.3211 -0.3513 -0.2362 -0.2353 -0.2101 -0.1588 -0.3398 -0.4352 -0.3489 -0.1992 0.3684 -0.0351 -0.2120 0.0181 -0.1546 -0.1187 0.0221 0.3229 0.3772 -0.1036 0.3585 0.4124 -0.1293 -0.1235 0.1415 0.1186 0.1951 0.0950 0.1025 0.1302 0.1312 0.0326 0.0808 0.1749 0.1151 0.0722 0.0842 0.1255 0.1315 0.0925 0.1243 0.1085 0.1133
va: 5.8468 2.1117 2.0688 2.0268 2.0033 2.1657 2.1530 2.1644 3.0745 3.1773 2.9838 2.9131 2.9233 3.9353 3.8107 3.9610 3.9529 3.8758 3.9804 4.0029 4.0361 4.4252 4.1921 3.9350 4.2926 4.2526 3.8613 3.8755 1.0209 1.0148 1.0741 0.9971 0.9947 1.0008 0.9981 0.9966 0.9877 1.0314 0.9936 0.9936 0.9914 0.9949 0.9966 0.9988 0.9934 0.9949 0.9977
dispcorr: -0.027358004 hartree
energy: -1781.747228617822
dipole: 12.54809 -10.93182 1.61627 17.50696 -15.81407 1.69289 -11.43223 10.85289 -0.57934
magnitude: 2.41119 au
magnitude: 6.12876 debye
