program: Orca
programVersion: 4.2.1
elementType: S O O O O O O O N N N N N C C C C C C C C C C C C C C C H H H H H H H H H H H H H H H H H H H
charge: 0
multiplicity: 1
keywords: wb97x-d3
keywords: def2-TZVPP
keywords: def2/J RIJCOSX GRIDX6 NOFINALGRIDX
keywords: grid4 nofinalgrid
keywords: scfconv7
keywords: smallprint printgap noloewdin
keywords: NOSOSCF
formula: C15H19N5O7S
InChI: InChI=1S/C15H19N5O7S/c1-24-8-9-27-10-6-4-5-7-11(10)28(22,23)20-13(21)16-12-17-14(25-2)19-15(18-12)26-3/h4-7,16,20H,8-9H2,1-3H3
47 atoms
S  -2.35719 -1.652608 -0.115227
O  -1.482433 0.890689 1.081214
O  -2.014241 -2.007052 1.244732
O  -3.082666 -2.569601 -0.957566
O  1.200405 2.678864 2.590056
O  -1.56643 -0.526629 -2.819392
O  2.927146 -1.513483 1.495483
O  4.965062 0.691416 -1.848148
N  -0.865299 -1.314124 -0.798987
N  0.631947 -0.388887 -2.321178
N  2.830653 0.143784 -2.103972
N  1.729645 -1.000356 -0.365205
N  3.989024 -0.408693 -0.11824
C  -3.203031 -0.099245 -0.152742
C  -2.684801 1.020955 0.509697
C  -4.417651 -0.034735 -0.814465
C  -3.427339 2.197221 0.510253
C  -0.857504 2.017738 1.66012
C  -5.150387 1.140404 -0.808027
C  -4.651118 2.245368 -0.140887
C  0.535325 1.574024 2.058763
C  -0.691272 -0.745716 -2.026287
C  1.766065 -0.420597 -1.565995
C  2.526993 2.39519 2.937053
C  2.868577 -0.965934 0.306205
C  3.906319 0.119793 -1.328501
C  1.777518 -2.188447 1.997155
C  6.163045 0.719139 -1.084096
H  -4.783171 -0.906132 -1.338422
H  -3.064252 3.081534 1.01494
H  -0.052783 -1.397377 -0.185005
H  -1.414263 2.369168 2.535629
H  -0.791858 2.842608 0.941873
H  -6.098596 1.189805 -1.323917
H  -5.214543 3.168965 -0.126384
H  0.469187 0.75133 2.786691
H  1.052768 1.181111 1.171777
H  0.740798 0.051208 -3.223781
H  2.596787 1.619404 3.709723
H  3.118189 2.0599 2.074752
H  2.972787 3.309086 3.326135
H  2.072866 -2.586935 2.963259
H  1.475215 -3.008421 1.345576
H  0.92982 -1.515554 2.129768
H  6.890425 1.236002 -1.703599
H  6.519908 -0.285435 -0.858418
H  6.029689 1.258691 -0.146625
totalener: -1781.72011937 hartree
nucrepener: 3089.87129550 hartree
electener: -4871.59141487 hartree
oneelecener: -8585.21796363 hartree
twoeener: 3713.62654876 hartree
kineticenergy: 1775.35367192 hartree
xcener: -146.590791975545 hartree
chargesum: -0.0000000
charge: 0.857798 -0.292331 -0.465078 -0.437163 -0.320867 -0.352235 -0.236413 -0.235616 -0.209151 -0.157533 -0.340042 -0.438941 -0.349091 -0.201804 0.366935 -0.032966 -0.211009 0.017147 -0.155276 -0.117360 0.023595 0.323445 0.378098 -0.106071 0.365023 0.409710 -0.128152 -0.124903 0.141485 0.118264 0.194435 0.102970 0.094460 0.130667 0.131118 0.080729 0.031899 0.174742 0.083469 0.075413 0.114344 0.131142 0.123733 0.093984 0.124821 0.113652 0.108928
qa: 0.8578 -0.2923 -0.4651 -0.4372 -0.3209 -0.3522 -0.2364 -0.2356 -0.2092 -0.1575 -0.3400 -0.4389 -0.3491 -0.2018 0.3669 -0.0330 -0.2110 0.0171 -0.1553 -0.1174 0.0236 0.3234 0.3781 -0.1061 0.3650 0.4097 -0.1282 -0.1249 0.1415 0.1183 0.1944 0.1030 0.0945 0.1307 0.1311 0.0807 0.0319 0.1747 0.0835 0.0754 0.1143 0.1311 0.1237 0.0940 0.1248 0.1137 0.1089
va: 5.8495 2.1125 2.0279 2.0689 2.0025 2.1649 2.1541 2.1641 3.0746 3.1768 2.9841 2.9137 2.9256 3.9376 3.8135 3.9596 3.9539 3.8772 3.9791 4.0006 4.0324 4.4243 4.1913 3.9350 4.2857 4.2588 3.8613 3.8736 1.0209 1.0152 1.0737 0.9941 0.9974 1.0006 0.9982 0.9873 0.9973 1.0315 0.9908 0.9931 0.9939 0.9968 0.9958 0.9974 0.9934 0.9975 0.9960
dispcorr: -0.027075656 hartree
energy: -1781.747195030982
dipole: 12.61183 -10.99779 1.61405 13.95414 -12.45771 1.49643 15.49399 -14.51677 0.97722
magnitude: 2.40820 au
magnitude: 6.12115 debye
