program: Orca
programVersion: 4.2.1
elementType: S O O O O O O O N N N N N C C C C C C C C C C C C C C C H H H H H H H H H H H H H H H H H H H
charge: 0
multiplicity: 1
keywords: wb97x-d3
keywords: def2-TZVPP
keywords: def2/J RIJCOSX GRIDX6 NOFINALGRIDX
keywords: grid4 nofinalgrid
keywords: scfconv7
keywords: smallprint printgap noloewdin
keywords: NOSOSCF
formula: C15H19N5O7S
InChI: InChI=1S/C15H19N5O7S/c1-24-8-9-27-10-6-4-5-7-11(10)28(22,23)20-13(21)16-12-17-14(25-2)19-15(18-12)26-3/h4-7,16,20H,8-9H2,1-3H3
47 atoms
S  -2.337515 -1.584685 -0.122384
O  -1.50233 0.942865 1.159905
O  -2.018751 -1.926697 1.24666
O  -3.067741 -2.504083 -0.958493
O  1.269312 1.461392 2.009293
O  -1.537532 -0.481406 -2.821389
O  2.918259 -1.556199 1.486872
O  4.963998 0.819187 -1.735687
N  -0.840717 -1.266549 -0.797506
N  0.653755 -0.313798 -2.304273
N  2.840114 0.253764 -2.038325
N  1.740612 -0.986622 -0.367418
N  3.983878 -0.367105 -0.064937
C  -3.152769 -0.01648 -0.202319
C  -2.651921 1.094814 0.488725
C  -4.313018 0.073439 -0.952495
C  -3.361263 2.291034 0.416655
C  -1.066561 1.998583 1.990027
C  -5.01388 1.266077 -1.011154
C  -4.531653 2.365435 -0.323861
C  0.12539 1.568255 2.806386
C  -0.663985 -0.690901 -2.022833
C  1.780303 -0.35196 -1.537013
C  2.449421 1.441246 2.767992
C  2.865127 -0.956844 0.322336
C  3.906358 0.21134 -1.251873
C  1.743314 -2.195648 1.97417
C  6.152018 0.829426 -0.958144
H  -4.661485 -0.794355 -1.493499
H  -3.009795 3.177568 0.92446
H  -0.028613 -1.339041 -0.17898
H  -1.864645 2.284899 2.68484
H  -0.802746 2.880854 1.395454
H  -5.920292 1.334003 -1.595478
H  -5.064558 3.306259 -0.364376
H  0.261689 2.337086 3.582619
H  -0.097944 0.627584 3.330482
H  0.762093 0.154667 -3.192174
H  3.29164 1.369824 2.082345
H  2.563366 2.356627 3.363385
H  2.49484 0.58713 3.453945
H  0.921842 -1.490467 2.103034
H  2.017565 -2.613544 2.938617
H  1.417593 -2.999788 1.313803
H  6.518468 -0.179063 -0.767345
H  6.00336 1.33036 -0.001432
H  6.880825 1.378478 -1.547868
totalener: -1781.72103909 hartree
nucrepener: 3122.20668852 hartree
electener: -4903.92772761 hartree
oneelecener: -8650.72213265 hartree
twoeener: 3746.79440504 hartree
kineticenergy: 1775.35956696 hartree
xcener: -146.592172171821 hartree
chargesum: 0.0000000
charge: 0.858107 -0.279829 -0.468207 -0.438805 -0.320564 -0.358172 -0.243294 -0.238351 -0.210205 -0.159847 -0.345031 -0.409146 -0.367008 -0.217360 0.372777 -0.019460 -0.215164 0.013214 -0.155846 -0.116442 -0.009634 0.326012 0.376742 -0.127343 0.377603 0.417221 -0.143237 -0.124867 0.139710 0.116151 0.200150 0.090130 0.090172 0.129805 0.129882 0.074597 0.084506 0.172440 0.107454 0.096834 0.090400 0.100080 0.131872 0.129472 0.112912 0.105812 0.123752
qa: 0.8581 -0.2798 -0.4682 -0.4388 -0.3206 -0.3582 -0.2433 -0.2384 -0.2102 -0.1598 -0.3450 -0.4091 -0.3670 -0.2174 0.3728 -0.0195 -0.2152 0.0132 -0.1558 -0.1164 -0.0096 0.3260 0.3767 -0.1273 0.3776 0.4172 -0.1432 -0.1249 0.1397 0.1162 0.2002 0.0901 0.0902 0.1298 0.1299 0.0746 0.0845 0.1724 0.1075 0.0968 0.0904 0.1001 0.1319 0.1295 0.1129 0.1058 0.1238
va: 5.8574 2.1278 2.0260 2.0680 1.9517 2.1595 2.1454 2.1596 3.0740 3.1822 2.9863 2.9324 2.9154 3.9417 3.8012 3.9427 3.9426 3.9194 3.9808 4.0026 3.9948 4.4199 4.2112 3.9180 4.2753 4.2542 3.8565 3.8814 1.0220 1.0145 1.0709 0.9923 0.9968 1.0006 0.9985 0.9983 0.9925 1.0332 0.9993 0.9967 0.9841 0.9917 0.9957 0.9983 0.9974 0.9943 0.9935
dispcorr: -0.027620583 hartree
energy: -1781.748659675960
dipole: 11.01513 -9.63932 1.37581 13.67785 -11.70988 1.96797 18.08817 -16.47321 1.61497
magnitude: 2.89377 au
magnitude: 7.35537 debye
