program: Gaussian 09
title: 000069108
version: EM64L-G09RevD.01
frameworkgroup: C1[X(C5H5NO2)]
method: RPBEPBE
basis: SDD
operation: Freq
keyword: #pfreq=noraman
keyword: PBEPBE/SDD
title: #p freq=noraman PBEPBE/SDD
converged: YES YES NO YES
title: Mulliken charges:
elementType: O O N C C C C C H H H H H
charge: -0.259115 -0.260453 -0.625659 0.229988 -0.333629 -0.249062 -0.146148 0.157856 0.285109 0.258897 0.263051 0.341636 0.337529
chargesum: 0.00000
title: Mulliken charges with hydrogens summed into heavy atoms:
elementType: O O N C C C C C
charge: -0.259115 -0.260453 0.053506 0.229988 -0.048520 0.009835 0.116902 0.157856
polarizability: 9.24817921e+01 -1.44465447e-01 7.14484677e+01 2.81933159e-03 2.67417048e-04 2.78165300e+01
1716.lowfreq: -5.6308 -4.3096 0.0010 0.0010 0.0012 3.6841 90.1615 176.5362 184.2039
frequency: 90.1584 176.5357 184.2033 387.1105 478.8501 530.1683 558.3666 589.4899 617.9784 634.3434 732.3223 739.7995 842.0219 869.6776 881.4810 901.0345 1003.6415 1037.2352 1056.2041 1122.7948 1141.3244 1206.8009 1346.4902 1360.4255 1474.3194 1573.6618 1592.4166 1628.3622 3226.6747 3246.6817 3267.6349 3523.1180 3681.4911
redmass: 5.1799 5.0593 4.6954 5.0026 5.3259 1.5664 1.1498 2.8232 2.4258 3.7621 3.6920 1.4427 1.3388 6.5716 4.5207 1.3951 1.4780 3.2815 1.9860 1.9346 2.8873 1.4917 4.1589 2.7880 4.9450 2.2008 3.9610 2.5844 1.0914 1.0993 1.1092 1.0445 1.1050
irintensity: 10.4856 3.3756 12.2743 1.2746 1.9926 48.0860 210.4045 0.6651 60.0911 18.2045 2.1308 123.0488 20.5267 7.6592 16.7146 2.2013 35.6269 2.8903 0.6068 0.4518 27.2007 7.5616 178.8681 18.7238 35.1842 22.2356 163.0746 278.1283 1.7628 0.9262 0.3143 51.1878 43.1231
temp: 298.150 k
press: 1.00000 atm
elementType: 8 8 7 6 6 6 6 6 1 1 1 1 1
symmnumber: 1
zpe: 249438.2 jmol-1
zpe.correction: 0.095006 hartree
zpe.thermalcorrener: 0.101813 hartree
zpe.thermalcorrenthalpy: 0.102757 hartree
zpe.thermalcorrgfe: 0.063783 hartree
zpe.sumelectzpe: -398.140278 hartree
zpe.sumelectthermal: -398.133471 hartree
zpe.sumelectthermalent: -398.132527 hartree
zpe.sumelectthermalfe: -398.171501 hartree
dipole: 2.4790 -2.9558 0.0015
dipole: 3.8578
quadrupole: -39.8686 -42.6647 -49.0673
quadrupole: 8.9390 -0.0017 0.0019
quadrupole: 3.9983 1.2022 -5.2004 8.9390 -0.0017 0.0019
hfenergy: -398.2352838 hartree
pointgroup: C01 [X(C5H5N1O2)]
dipole: -0.9839352 1.1556206 -0.0013999 debye
dipolederiv: -0.3691817 -0.1867343 0.0001551 -0.1541308 -0.6212004 0.0007868 -0.0000261 0.0007435 -0.1268955 -0.8732581 0.2652944 -0.0004849 0.1966937 -0.8824444 0.0005594 -0.0004925 0.0005447 -0.3767856 -0.5951803 -0.4144334 0.0004163 -0.4440886 -0.9952529 -0.000042 0.0003599 -0.0000842 -0.7190423 -0.5773263 -0.0438674 -0.0001313 -0.1390254 0.3036258 -0.0006796 0.0000891 -0.0005435 -0.0022969 0.1546528 -0.0935266 0.0002742 -0.0197012 -0.0150326 -0.0001993 0.0001487 -0.000238 -0.1451296 -0.0277071 0.0589629 -0.0000514 0.1540116 -0.136199 -0.0000311 -0.0002382 -0.0000693 -0.2070051 0.0297034 0.1549897 -0.0002107 0.1032171 0.2811342 -0.0006511 -0.0000438 -0.0006897 -0.120954 1.6871592 0.1641563 0.0004687 0.1939395 1.476128 -0.0009294 0.0005214 -0.0009833 0.287093 0.1218883 0.0462026 -0.0001016 0.0368687 0.047751 0.0002622 -0.0000865 0.0002548 0.1978051 -0.0120104 -0.0544411 0.0000142 -0.0618678 0.1076601 0.0001306 0.0000242 0.000131 0.2015361 0.0566639 0.0319627 -0.0001139 0.0475257 0.0436088 0.0003225 -0.0001587 0.0003368 0.2216224 0.206509 0.0379183 -0.0001386 0.0712634 0.2028005 0.0002487 -0.0001234 0.0003149 0.3985931 0.1980873 0.0335159 -0.0000959 0.0152943 0.1874209 0.0002221 0.000026 0.0002822 0.3914593 unknown
polarizability: 92.4827666|0.0120829|71.4474046|0.0265576|-0.0582516|27.8166186 unknown
InChI: InChI=1S/C5H5NO2/c6-5(7)4-2-1-3-8-4/h1-3H,6H2
charge 0 multiplicity 1
13 atoms
O  -0.660079 1.123838 -0.001965
O  2.201248 -1.161108 0.002355
N  2.090106 1.175182 0.000133
C  0.041258 -0.111051 0.000336
C  -0.869749 -1.156927 0.001683
C  -2.191334 -0.573222 0.000274
C  -2.027443 0.803434 -0.001873
C  1.522314 -0.088186 0.001117
H  -0.603897 -2.211269 0.003472
H  -3.140492 -1.10499 0.000811
H  -2.711125 1.647941 -0.003561
H  1.513394 2.015603 -0.001122
H  3.105898 1.248756 0.000341
