program: Orca
programVersion: 4.2.1
elementType: S O O O O O O O N N N N N C C C C C C C C C C C C C C C H H H H H H H H H H H H H H H H H H H
charge: 0
multiplicity: 1
keywords: wb97x-d3
keywords: def2-TZVPP
keywords: def2/J RIJCOSX GRIDX6 NOFINALGRIDX
keywords: grid4 nofinalgrid
keywords: scfconv7
keywords: smallprint printgap noloewdin
keywords: NOSOSCF
formula: C15H19N5O7S
InChI: InChI=1S/C15H19N5O7S/c1-24-8-9-27-10-6-4-5-7-11(10)28(22,23)20-13(21)16-12-17-14(25-2)19-15(18-12)26-3/h4-7,16,20H,8-9H2,1-3H3
47 atoms
S  -2.207574 -1.381761 -0.005828
O  -1.484249 1.263937 1.039099
O  -1.921891 -1.600786 1.3952
O  -2.872702 -2.396058 -0.784174
O  -0.013878 1.74627 3.741618
O  -1.372065 -0.480163 -2.750923
O  3.215109 -1.508636 1.482923
O  5.262849 0.29573 -2.082447
N  -0.694173 -1.067231 -0.65847
N  0.827234 -0.349005 -2.270789
N  3.070324 -0.028226 -2.188433
N  1.95277 -0.925657 -0.31711
N  4.281991 -0.613103 -0.247436
C  -3.07459 0.140958 -0.249856
C  -2.612784 1.332037 0.324749
C  -4.221248 0.121909 -1.025512
C  -3.33212 2.501653 0.099941
C  -0.901132 2.445523 1.555069
C  -4.940903 1.287413 -1.228021
C  -4.488645 2.467983 -0.665145
C  0.289537 2.070746 2.420733
C  -0.499791 -0.639417 -1.939425
C  1.986376 -0.440044 -1.559002
C  -0.752479 0.564694 3.932031
C  3.133895 -1.00434 0.276273
C  4.183055 -0.130781 -1.474084
C  2.039473 -2.026285 2.092065
C  6.502083 0.223358 -1.389839
H  -4.540628 -0.805897 -1.477608
H  -3.00335 3.444423 0.51335
H  0.11018 -1.134852 -0.033271
H  -1.618706 3.017303 2.154298
H  -0.568284 3.084042 0.727428
H  -5.836838 1.272434 -1.831861
H  -5.036217 3.387486 -0.824482
H  0.852656 1.270299 1.915245
H  0.948653 2.940539 2.471023
H  0.940751 -0.001295 -3.212221
H  -0.711936 0.332273 4.99533
H  -1.802394 0.659757 3.641504
H  -0.339763 -0.282755 3.37516
H  2.35657 -2.418173 3.053989
H  1.597339 -2.828651 1.500737
H  1.288978 -1.251737 2.252237
H  7.242252 0.623566 -2.076939
H  6.758325 -0.803424 -1.130183
H  6.488204 0.81877 -0.477164
totalener: -1781.71836157 hartree
nucrepener: 3075.59770622 hartree
electener: -4857.31606779 hartree
oneelecener: -8556.87532194 hartree
twoeener: 3699.55925415 hartree
kineticenergy: 1775.35643947 hartree
xcener: -146.590937521134 hartree
chargesum: -0.0000000
charge: 0.862028 -0.294567 -0.471589 -0.435863 -0.321814 -0.358636 -0.237991 -0.237421 -0.203102 -0.160105 -0.345403 -0.445947 -0.347468 -0.189824 0.347737 -0.017895 -0.204657 -0.048633 -0.156183 -0.112356 0.025810 0.329732 0.378565 -0.083203 0.385681 0.402579 -0.100309 -0.122693 0.139102 0.114710 0.187530 0.109805 0.107964 0.130098 0.130734 0.036794 0.095987 0.175221 0.111808 0.090399 0.063474 0.131202 0.123795 0.067109 0.123549 0.112745 0.111497
qa: 0.8620 -0.2946 -0.4716 -0.4359 -0.3218 -0.3586 -0.2380 -0.2374 -0.2031 -0.1601 -0.3454 -0.4459 -0.3475 -0.1898 0.3477 -0.0179 -0.2047 -0.0486 -0.1562 -0.1124 0.0258 0.3297 0.3786 -0.0832 0.3857 0.4026 -0.1003 -0.1227 0.1391 0.1147 0.1875 0.1098 0.1080 0.1301 0.1307 0.0368 0.0960 0.1752 0.1118 0.0904 0.0635 0.1312 0.1238 0.0671 0.1235 0.1127 0.1115
va: 5.8376 2.0822 2.0161 2.0715 1.9893 2.1580 2.1661 2.1626 3.0737 3.1781 2.9804 2.9197 2.9540 3.9474 3.8086 3.9372 3.9585 3.7931 3.9800 4.0022 4.0505 4.4174 4.1987 3.9235 4.2920 4.2766 3.8861 3.8666 1.0219 1.0152 1.0734 0.9911 0.9964 1.0008 0.9979 1.0058 1.0000 1.0318 0.9917 0.9928 0.9882 0.9993 0.9966 0.9793 0.9932 0.9980 0.9978
dispcorr: -0.026779239 hartree
energy: -1781.745140805472
dipole: 4.96902 -3.80699 1.16203 11.06156 -9.52564 1.53593 15.32992 -14.92041 0.40951
magnitude: 1.96903 au
magnitude: 5.00487 debye
