program: Orca
programVersion: 4.2.1
elementType: S O O O O O O O N N N N N C C C C C C C C C C C C C C C H H H H H H H H H H H H H H H H H H H
charge: 0
multiplicity: 1
keywords: wb97x-d3
keywords: def2-TZVPP
keywords: def2/J RIJCOSX GRIDX6 NOFINALGRIDX
keywords: grid4 nofinalgrid
keywords: scfconv7
keywords: smallprint printgap noloewdin
keywords: NOSOSCF
formula: C15H19N5O7S
InChI: InChI=1S/C15H19N5O7S/c1-24-8-9-27-10-6-4-5-7-11(10)28(22,23)20-13(21)16-12-17-14(25-2)19-15(18-12)26-3/h4-7,16,20H,8-9H2,1-3H3
47 atoms
S  -2.318556 -1.57836 -0.291422
O  -1.451656 0.817077 1.208504
O  -2.117935 -2.132096 1.03098
O  -2.984093 -2.342586 -1.317001
O  1.357367 1.603981 1.049194
O  -1.252356 0.033862 -2.630673
O  2.745589 -2.059069 1.766154
O  5.21126 0.675098 -0.718263
N  -0.766162 -1.204184 -0.779262
N  0.894195 -0.066529 -1.932487
N  3.063274 0.327429 -1.373974
N  1.778189 -1.153165 -0.078881
N  3.999383 -0.690575 0.54196
C  -3.147092 -0.018513 -0.165652
C  -2.658971 1.001728 0.660615
C  -4.352337 0.123086 -0.831821
C  -3.435901 2.142693 0.83626
C  -0.879361 1.831062 2.004433
C  -5.110867 1.269838 -0.664298
C  -4.651275 2.265544 0.178566
C  0.585669 1.504445 2.212393
C  -0.461163 -0.397218 -1.834492
C  1.937386 -0.310937 -1.088661
C  1.693838 2.912511 0.676893
C  2.835281 -1.28018 0.713581
C  4.050259 0.090506 -0.521929
C  1.527331 -2.751266 2.006662
C  5.363035 1.522491 -1.844546
H  -4.693652 -0.668439 -1.483274
H  -3.112354 2.942155 1.487255
H  -0.011678 -1.443216 -0.128409
H  -1.381984 1.88566 2.977526
H  -0.9836 2.811532 1.526342
H  -6.051565 1.377702 -1.184939
H  -5.239708 3.160741 0.330492
H  0.970168 2.16318 3.004456
H  0.681679 0.478604 2.57487
H  1.103538 0.56027 -2.694951
H  2.33817 2.844383 -0.198071
H  0.824158 3.52159 0.404143
H  2.240842 3.436083 1.470586
H  1.695143 -3.331575 2.909396
H  1.274917 -3.425611 1.187748
H  0.689754 -2.070933 2.168751
H  6.390847 1.873319 -1.810193
H  4.686631 2.37719 -1.803846
H  5.191236 0.989769 -2.780085
totalener: -1781.71811717 hartree
nucrepener: 3164.16614272 hartree
electener: -4945.88425989 hartree
oneelecener: -8734.48848189 hartree
twoeener: 3788.60422200 hartree
kineticenergy: 1775.36434118 hartree
xcener: -146.596267651903 hartree
chargesum: -0.0000000
charge: 0.856927 -0.276601 -0.467527 -0.441441 -0.314497 -0.359259 -0.234764 -0.234868 -0.197017 -0.146605 -0.423957 -0.422086 -0.280334 -0.192559 0.379540 -0.040302 -0.221115 0.004702 -0.162840 -0.112557 -0.029662 0.316635 0.361327 -0.098839 0.399868 0.409481 -0.127705 -0.126580 0.143047 0.113829 0.191135 0.107318 0.074762 0.129958 0.129460 0.086783 0.096117 0.165039 0.085690 0.091937 0.096094 0.127993 0.118359 0.090941 0.125678 0.098972 0.109525
qa: 0.8569 -0.2766 -0.4675 -0.4414 -0.3145 -0.3593 -0.2348 -0.2349 -0.1970 -0.1466 -0.4240 -0.4221 -0.2803 -0.1926 0.3795 -0.0403 -0.2211 0.0047 -0.1628 -0.1126 -0.0297 0.3166 0.3613 -0.0988 0.3999 0.4095 -0.1277 -0.1266 0.1430 0.1138 0.1911 0.1073 0.0748 0.1300 0.1295 0.0868 0.0961 0.1650 0.0857 0.0919 0.0961 0.1280 0.1184 0.0909 0.1257 0.0990 0.1095
va: 5.8470 2.1158 2.0234 2.0622 1.9671 2.1585 2.1560 2.1502 3.0755 3.1824 2.9153 2.9275 2.9730 3.9231 3.8097 3.9656 3.9531 3.8373 3.9889 3.9996 3.9830 4.4368 4.2553 3.9228 4.2537 4.2547 3.8794 3.8939 1.0208 1.0141 1.0848 0.9960 0.9884 1.0010 0.9983 1.0055 0.9946 1.0377 1.0054 0.9833 0.9947 0.9971 0.9941 0.9962 0.9947 0.9903 0.9966
dispcorr: -0.029305097 hartree
energy: -1781.747422270053
dipole: 6.27467 -5.63862 0.63605 18.49557 -15.89213 2.60344 8.23024 -7.51733 0.71290
magnitude: 2.77321 au
magnitude: 7.04894 debye
