program: Orca
programVersion: 4.2.1
elementType: S O O O O O O O N N N N N C C C C C C C C C C C C C C C H H H H H H H H H H H H H H H H H H H
charge: 0
multiplicity: 1
keywords: wb97x-d3
keywords: def2-TZVPP
keywords: def2/J RIJCOSX GRIDX6 NOFINALGRIDX
keywords: grid4 nofinalgrid
keywords: scfconv7
keywords: smallprint printgap noloewdin
keywords: NOSOSCF
formula: C15H19N5O7S
InChI: InChI=1S/C15H19N5O7S/c1-24-8-9-27-10-6-4-5-7-11(10)28(22,23)20-13(21)16-12-17-14(25-2)19-15(18-12)26-3/h4-7,16,20H,8-9H2,1-3H3
47 atoms
S  -2.321525 -1.568566 -0.198991
O  -1.528931 0.905945 1.209003
O  -2.013015 -1.962508 1.158216
O  -3.038099 -2.45911 -1.077137
O  1.236103 1.422484 2.050374
O  -1.502543 -0.365639 -2.849579
O  2.921081 -1.592867 1.449555
O  5.012136 0.828518 -1.709295
N  -0.820344 -1.215685 -0.84708
N  0.686964 -0.225974 -2.316504
N  2.880374 0.303872 -2.030596
N  1.758755 -0.962743 -0.39456
N  4.009361 -0.38259 -0.070295
C  -3.145039 -0.003125 -0.22675
C  -2.665837 1.07989 0.52233
C  -4.288772 0.113503 -0.998365
C  -3.382897 2.273298 0.489079
C  -1.102336 1.937732 2.072645
C  -4.995348 1.303892 -1.021115
C  -4.536712 2.37386 -0.273881
C  0.101486 1.494756 2.86413
C  -0.634474 -0.603981 -2.05319
C  1.810519 -0.299266 -1.547667
C  2.425934 1.382347 2.792424
C  2.881242 -0.965834 0.299117
C  3.943879 0.225558 -1.243149
C  1.73337 -2.222113 1.919456
C  6.198135 0.800314 -0.928808
H  -4.619732 -0.731587 -1.58438
H  -3.0506 3.137881 1.045243
H  -0.011765 -1.312678 -0.227235
H  -1.899388 2.189922 2.781881
H  -0.853262 2.843342 1.50754
H  -5.888162 1.392938 -1.623205
H  -5.074879 3.31249 -0.284708
H  0.239653 2.241368 3.661379
H  -0.106769 0.536688 3.362186
H  0.803965 0.266696 -3.19008
H  2.541438 2.274648 3.421561
H  2.487316 0.502482 3.44374
H  3.259563 1.344762 2.093522
H  1.403532 -3.014867 1.247431
H  0.919894 -1.507848 2.048481
H  1.993369 -2.653865 2.881702
H  6.541295 -0.218771 -0.751898
H  6.057688 1.290346 0.034782
H  6.940657 1.341662 -1.508404
totalener: -1781.72108160 hartree
nucrepener: 3119.90039992 hartree
electener: -4901.62148152 hartree
oneelecener: -8646.10567960 hartree
twoeener: 3744.48419808 hartree
kineticenergy: 1775.36098708 hartree
xcener: -146.592485359238 hartree
chargesum: 0.0000000
charge: 0.857685 -0.279145 -0.467956 -0.438929 -0.320193 -0.358798 -0.243214 -0.238333 -0.210731 -0.159948 -0.345327 -0.408552 -0.365729 -0.220116 0.374508 -0.016947 -0.215297 0.013267 -0.156354 -0.117114 -0.010246 0.327209 0.377850 -0.128908 0.375099 0.416749 -0.144420 -0.124969 0.139663 0.115763 0.200490 0.090178 0.089700 0.129851 0.130073 0.075353 0.084868 0.172519 0.097565 0.090819 0.107060 0.130452 0.099544 0.132148 0.112848 0.106129 0.123837
qa: 0.8577 -0.2791 -0.4680 -0.4389 -0.3202 -0.3588 -0.2432 -0.2383 -0.2107 -0.1599 -0.3453 -0.4086 -0.3657 -0.2201 0.3745 -0.0169 -0.2153 0.0133 -0.1564 -0.1171 -0.0102 0.3272 0.3778 -0.1289 0.3751 0.4167 -0.1444 -0.1250 0.1397 0.1158 0.2005 0.0902 0.0897 0.1299 0.1301 0.0754 0.0849 0.1725 0.0976 0.0908 0.1071 0.1305 0.0995 0.1321 0.1128 0.1061 0.1238
va: 5.8579 2.1290 2.0267 2.0678 1.9520 2.1593 2.1450 2.1596 3.0747 3.1825 2.9859 2.9338 2.9153 3.9449 3.8014 3.9395 3.9419 3.9200 3.9811 4.0032 3.9959 4.4193 4.2098 3.9199 4.2779 4.2541 3.8559 3.8804 1.0221 1.0149 1.0703 0.9920 0.9968 1.0005 0.9984 0.9985 0.9920 1.0331 0.9967 0.9838 0.9992 0.9984 0.9916 0.9956 0.9976 0.9947 0.9935
dispcorr: -0.027566032 hartree
energy: -1781.748647635843
dipole: 10.82874 -9.46562 1.36312 13.11726 -11.20294 1.91432 18.56491 -16.87462 1.69029
magnitude: 2.89479 au
magnitude: 7.35797 debye
