program: Orca
programVersion: 4.2.1
elementType: S O O O O O O O N N N N N C C C C C C C C C C C C C C C H H H H H H H H H H H H H H H H H H H
charge: 0
multiplicity: 1
keywords: wb97x-d3
keywords: def2-TZVPP
keywords: def2/J RIJCOSX GRIDX6 NOFINALGRIDX
keywords: grid4 nofinalgrid
keywords: scfconv7
keywords: smallprint printgap noloewdin
keywords: NOSOSCF
formula: C15H19N5O7S
InChI: InChI=1S/C15H19N5O7S/c1-24-8-9-27-10-6-4-5-7-11(10)28(22,23)20-13(21)16-12-17-14(25-2)19-15(18-12)26-3/h4-7,16,20H,8-9H2,1-3H3
47 atoms
S  -2.32213 -1.568267 -0.198486
O  -1.530387 0.90742 1.206944
O  -2.013507 -1.96167 1.158892
O  -3.037949 -2.459436 -1.076613
O  1.233418 1.425337 2.048847
O  -1.50194 -0.368414 -2.850598
O  2.92132 -1.591962 1.451015
O  5.013493 0.822426 -1.712298
N  -0.821138 -1.214623 -0.845934
N  0.687601 -0.230024 -2.317321
N  2.88126 0.299088 -2.03216
N  1.758646 -0.963397 -0.39355
N  4.010237 -0.385649 -0.071271
C  -3.14739 -0.003743 -0.226458
C  -2.66866 1.079897 0.522089
C  -4.29211 0.111416 -0.996752
C  -3.387136 2.272474 0.489569
C  -1.105369 1.938351 2.072427
C  -5.000253 1.300882 -1.018619
C  -4.541932 2.371575 -0.27227
C  0.099099 1.495629 2.863172
C  -0.634189 -0.606521 -2.053681
C  1.810952 -0.302019 -1.547987
C  2.423746 1.386112 2.790115
C  2.881283 -0.966544 0.299706
C  3.945178 0.220379 -1.245088
C  1.733881 -2.220524 1.922386
C  6.199517 0.795532 -0.931836
H  -4.62268 -0.734104 -1.582355
H  -3.055312 3.137462 1.045504
H  -0.013157 -1.310803 -0.225302
H  -1.902848 2.188024 2.782069
H  -0.857589 2.845398 1.508969
H  -5.893791 1.388827 -1.619801
H  -5.081846 3.309233 -0.281648
H  0.236822 2.241441 3.661259
H  -0.108179 0.536748 3.360108
H  0.804568 0.260662 -3.19205
H  3.256993 1.350133 2.090609
H  2.538535 2.278043 3.419916
H  2.486764 0.505772 3.440669
H  0.920456 -1.506093 2.05097
H  1.99443 -2.650982 2.885089
H  1.403572 -3.014176 1.251663
H  6.941715 1.337021 -1.511815
H  6.543398 -0.223287 -0.754422
H  6.058876 1.286024 0.031512
totalener: -1781.72110087 hartree
nucrepener: 3119.48697148 hartree
electener: -4901.20807235 hartree
oneelecener: -8645.27948748 hartree
twoeener: 3744.07141513 hartree
kineticenergy: 1775.35950187 hartree
xcener: -146.592188140079 hartree
chargesum: 0.0000000
charge: 0.857625 -0.279189 -0.468041 -0.438906 -0.320097 -0.358910 -0.243193 -0.238315 -0.210571 -0.160042 -0.345306 -0.408607 -0.365525 -0.219945 0.374399 -0.017150 -0.215210 0.013189 -0.156455 -0.117012 -0.010190 0.327453 0.377889 -0.129032 0.374977 0.416618 -0.144543 -0.124970 0.139694 0.115801 0.200541 0.090171 0.089689 0.129879 0.130071 0.075381 0.084820 0.172527 0.106997 0.097620 0.090858 0.099528 0.132179 0.130523 0.123803 0.112854 0.106125
qa: 0.8576 -0.2792 -0.4680 -0.4389 -0.3201 -0.3589 -0.2432 -0.2383 -0.2106 -0.1600 -0.3453 -0.4086 -0.3655 -0.2199 0.3744 -0.0172 -0.2152 0.0132 -0.1565 -0.1170 -0.0102 0.3275 0.3779 -0.1290 0.3750 0.4166 -0.1445 -0.1250 0.1397 0.1158 0.2005 0.0902 0.0897 0.1299 0.1301 0.0754 0.0848 0.1725 0.1070 0.0976 0.0909 0.0995 0.1322 0.1305 0.1238 0.1129 0.1061
va: 5.8582 2.1289 2.0266 2.0679 1.9521 2.1592 2.1449 2.1596 3.0750 3.1827 2.9860 2.9338 2.9156 3.9448 3.8014 3.9398 3.9420 3.9202 3.9811 4.0031 3.9960 4.4192 4.2097 3.9201 4.2781 4.2543 3.8560 3.8803 1.0220 1.0149 1.0701 0.9921 0.9968 1.0005 0.9984 0.9985 0.9920 1.0331 0.9992 0.9967 0.9838 0.9915 0.9955 0.9984 0.9935 0.9976 0.9947
dispcorr: -0.027554202 hartree
energy: -1781.748655072375
dipole: 10.81448 -9.45368 1.36080 13.12603 -11.21227 1.91376 18.56927 -16.87731 1.69196
magnitude: 2.89430 au
magnitude: 7.35673 debye
