program: Orca
programVersion: 5.0.2
elementType: S F F F F F F O O O O N N N N N C C C C C C C C C C C C C H H H H H H H H H
charge: 0
multiplicity: 1
keywords: wb97x-d3
keywords: def2-TZVPP
keywords: def2/J RIJCOSX
keywords: DEFGRID2
keywords: scfconv7
keywords: smallprint printgap noloewdin
keywords: NOSOSCF
formula: C13H9F6N5O4S
InChI: InChI=1S/C13H9F6N5O4S/c1-28-11-21-8(13(17,18)19)20-9(23-11)22-10(25)24-29(26,27)7-5-3-2-4-6(7)12(14,15)16/h2-5,22,24H,1H3
38 atoms
S  2.2940 0.77893 -1.456757
F  3.015965 0.123939 3.029159
F  3.478057 1.764342 1.734559
F  1.599774 0.721245 1.545584
F  -5.650489 -1.998744 -0.314576
F  -5.523784 -1.251985 1.701142
F  -6.385851 -0.033279 0.152991
O  2.563936 0.649832 -2.872879
O  2.348334 2.091145 -0.844923
O  0.968423 -1.798234 -2.112931
O  -2.450814 2.591149 0.820466
N  0.740856 0.249478 -1.156043
N  -1.027349 -1.273145 -1.207927
N  -3.169801 -1.094579 -0.440743
N  -1.677686 0.703154 -0.184901
N  -3.885982 0.906422 0.585422
C  3.359076 -0.366592 -0.593746
C  3.547637 -0.396954 0.798516
C  4.043574 -1.253482 -1.411318
C  4.418873 -1.341248 1.321203
C  2.90597 0.558403 1.77256
C  4.914954 -2.184707 -0.866829
C  5.096572 -2.231672 0.499905
C  0.287136 -0.980566 -1.535001
C  -1.977356 -0.519663 -0.59008
C  -4.053189 -0.32147 0.150496
C  -2.656931 1.377458 0.393106
C  -5.424585 -0.913646 0.413014
C  -1.147286 3.170364 0.675581
H  3.910565 -1.230489 -2.481975
H  4.589137 -1.396171 2.386142
H  0.108111 0.877303 -0.644996
H  5.440367 -2.867832 -1.519421
H  5.76738 -2.955586 0.941336
H  -1.32455 -2.198314 -1.498124
H  -1.228458 4.170627 1.089373
H  -0.856659 3.232571 -0.372189
H  -0.403959 2.60596 1.23609
elementType: S F O N C H
totalener: -2073.01256439 hartree
nucrepener: 3256.51256774 hartree
electener: -5329.52513212 hartree
oneelecener: -9333.13584437 hartree
twoeener: 4003.61071225 hartree
cpcmener: -0.04705388 hartree
kineticenergy: 2066.13827114 hartree
xcener: -163.686665424489 hartree
chargesum: 0.0000000
charge: 0.887736 -0.172986 -0.170838 -0.179071 -0.161417 -0.167483 -0.163335 -0.500917 -0.509462 -0.472885 -0.263546 -0.204533 -0.128596 -0.380123 -0.409305 -0.351585 -0.121399 -0.051169 -0.006852 -0.124135 0.547973 -0.164416 -0.102161 0.396568 0.425527 0.235147 0.472734 0.492083 -0.122949 0.154885 0.151122 0.242325 0.167945 0.170229 0.202089 0.140847 0.123726 0.118225
qa: 0.8877 -0.1730 -0.1708 -0.1791 -0.1614 -0.1675 -0.1633 -0.5009 -0.5095 -0.4729 -0.2635 -0.2045 -0.1286 -0.3801 -0.4093 -0.3516 -0.1214 -0.0512 -0.0069 -0.1241 0.5480 -0.1644 -0.1022 0.3966 0.4255 0.2351 0.4727 0.4921 -0.1229 0.1549 0.1511 0.2423 0.1679 0.1702 0.2021 0.1408 0.1237 0.1182
va: 5.8006 1.1323 1.1216 1.1229 1.1514 1.1351 1.1458 1.9976 1.9792 2.0426 2.1664 3.1094 3.2373 3.0098 2.9773 3.0092 3.8376 3.7623 3.8181 3.9484 4.4076 3.9649 3.8948 4.3821 4.2027 4.0772 4.2188 4.5247 3.8382 1.0173 1.0076 1.0183 0.9869 0.9851 1.0103 0.9950 0.9923 0.9985
dispcorr: -0.020712831 hartree
energy: -2073.033277216088
dipole: 23.72948 -22.17001 1.55947 0.89562 -2.15236 -1.25674 -8.12805 9.22844 1.10039
magnitude: 2.28521 au
magnitude: 5.80855 debye
