program: Orca
programVersion: 5.0.2
elementType: S F F F F F F O O O O N N N N N C C C C C C C C C C C C C H H H H H H H H H
charge: 0
multiplicity: 1
keywords: wb97x-d3
keywords: def2-TZVPP
keywords: def2/J RIJCOSX
keywords: DEFGRID2
keywords: scfconv7
keywords: smallprint printgap noloewdin
keywords: NOSOSCF
formula: C13H9F6N5O4S
InChI: InChI=1S/C13H9F6N5O4S/c1-28-11-21-8(13(17,18)19)20-9(23-11)22-10(25)24-29(26,27)7-5-3-2-4-6(7)12(14,15)16/h2-5,22,24H,1H3
38 atoms
S  2.275415 0.490821 -1.535803
F  3.050829 0.625448 2.973816
F  3.473993 2.050423 1.435667
F  1.62288 0.942247 1.418363
F  -5.538586 -1.231626 1.691634
F  -6.425807 0.107829 0.258559
F  -5.781885 -1.848875 -0.35473
O  2.517437 0.117943 -2.913494
O  2.341998 1.88961 -1.164071
O  0.952517 -2.155051 -1.710507
O  -2.478916 2.700363 0.335864
N  0.731551 0.023891 -1.115141
N  -1.056366 -1.468366 -0.954793
N  -3.21694 -1.137268 -0.299956
N  -1.706285 0.660976 -0.305794
N  -3.928916 1.012139 0.365299
C  3.367222 -0.474825 -0.506798
C  3.599744 -0.232434 0.85697
C  4.048061 -1.487923 -1.165065
C  4.530243 -1.023773 1.514017
C  2.932525 0.852318 1.664287
C  4.968853 -2.270614 -0.486013
C  5.21164 -2.035039 0.851577
C  0.268512 -1.247083 -1.293347
C  -2.012501 -0.610463 -0.505193
C  -4.104774 -0.266325 0.128037
C  -2.688884 1.43203 0.124246
C  -5.486459 -0.815455 0.424204
C  -1.175234 3.242396 0.086115
H  3.87508 -1.67701 -2.213529
H  4.742608 -0.862822 2.560618
H  0.098301 0.739853 -0.738609
H  5.491549 -3.056054 -1.013193
H  5.931232 -2.632868 1.39319
H  -1.356783 -2.427848 -1.085227
H  -0.88929 3.115753 -0.95715
H  -0.429009 2.786998 0.735312
H  -1.254225 4.30081 0.31363
elementType: S F O N C H
totalener: -2073.01275526 hartree
nucrepener: 3251.95803983 hartree
electener: -5324.97079509 hartree
oneelecener: -9324.07144423 hartree
twoeener: 3999.10064914 hartree
cpcmener: -0.04696150 hartree
kineticenergy: 2066.16271350 hartree
xcener: -163.691211755094 hartree
chargesum: -0.0000000
charge: 0.887744 -0.173504 -0.170419 -0.178284 -0.166908 -0.161947 -0.162258 -0.501998 -0.509478 -0.473822 -0.263110 -0.204608 -0.128339 -0.383431 -0.410081 -0.348264 -0.119470 -0.051182 -0.006347 -0.122031 0.547122 -0.162217 -0.106337 0.397983 0.425275 0.236182 0.474292 0.489229 -0.121610 0.152527 0.150133 0.243657 0.168155 0.169712 0.201683 0.123896 0.117315 0.140740
qa: 0.8877 -0.1735 -0.1704 -0.1783 -0.1669 -0.1619 -0.1623 -0.5020 -0.5095 -0.4738 -0.2631 -0.2046 -0.1283 -0.3834 -0.4101 -0.3483 -0.1195 -0.0512 -0.0063 -0.1220 0.5471 -0.1622 -0.1063 0.3980 0.4253 0.2362 0.4743 0.4892 -0.1216 0.1525 0.1501 0.2437 0.1682 0.1697 0.2017 0.1239 0.1173 0.1407
va: 5.8033 1.1310 1.1218 1.1228 1.1349 1.1486 1.1480 1.9976 1.9789 2.0424 2.1669 3.1111 3.2370 3.0190 2.9757 3.0002 3.8312 3.7616 3.8255 3.9525 4.4090 3.9635 3.8998 4.3817 4.2024 4.0774 4.2194 4.5261 3.8390 1.0188 1.0081 1.0160 0.9867 0.9854 1.0107 0.9926 0.9977 0.9950
dispcorr: -0.020596351 hartree
energy: -2073.033351610491
dipole: 24.07741 -22.47002 1.60739 -0.29126 -0.65435 -0.94561 -7.81365 9.10634 1.29269
magnitude: 2.26912 au
magnitude: 5.76765 debye
