program: Orca
programVersion: 5.0.2
elementType: S F F F F F F O O O O N N N N N C C C C C C C C C C C C C H H H H H H H H H
charge: 0
multiplicity: 1
keywords: wb97x-d3
keywords: def2-TZVPP
keywords: def2/J RIJCOSX
keywords: DEFGRID2
keywords: scfconv7
keywords: smallprint printgap noloewdin
keywords: NOSOSCF
formula: C13H9F6N5O4S
InChI: InChI=1S/C13H9F6N5O4S/c1-28-11-21-8(13(17,18)19)20-9(23-11)22-10(25)24-29(26,27)7-5-3-2-4-6(7)12(14,15)16/h2-5,22,24H,1H3
38 atoms
S  2.304499 0.532136 -1.532503
F  2.967673 0.56112 3.001623
F  3.414026 2.017117 1.499883
F  1.568158 0.901833 1.425053
F  -5.76491 -0.641538 1.692273
F  -6.351421 -0.155997 -0.322105
F  -5.576345 -2.110766 0.131635
O  2.587838 0.19385 -2.910641
O  2.361971 1.919751 -1.12171
O  0.975877 -2.101784 -1.829678
O  -2.470261 2.688509 0.348459
N  0.747533 0.059496 -1.172593
N  -1.035316 -1.440106 -1.058089
N  -3.181121 -1.147007 -0.344137
N  -1.689758 0.669198 -0.349522
N  -3.898346 0.9824 0.378116
C  3.362636 -0.463274 -0.496456
C  3.560023 -0.253695 0.878501
C  4.057576 -1.462768 -1.160794
C  4.471756 -1.062824 1.540002
C  2.873545 0.812686 1.694299
C  4.959841 -2.262981 -0.477298
C  5.168801 -2.05917 0.871088
C  0.289299 -1.207101 -1.389148
C  -1.987169 -0.600305 -0.56825
C  -4.064671 -0.295804 0.123453
C  -2.671698 1.422179 0.11652
C  -5.456732 -0.820351 0.408091
C  -1.174651 3.24793 0.09649
H  3.91102 -1.625885 -2.217687
H  4.657313 -0.927132 2.595243
H  0.109003 0.761716 -0.778973
H  5.494571 -3.036804 -1.009583
H  5.874192 -2.670297 1.416496
H  -1.334349 -2.396696 -1.211115
H  -1.26307 4.301908 0.340696
H  -0.894468 3.140434 -0.950437
H  -0.419639 2.790735 0.733943
elementType: S F O N C H
totalener: -2073.01283669 hartree
nucrepener: 3255.21254930 hartree
electener: -5328.22538599 hartree
oneelecener: -9330.54722700 hartree
twoeener: 4002.32184101 hartree
cpcmener: -0.04723357 hartree
kineticenergy: 2066.17105617 hartree
xcener: -163.692883682315 hartree
chargesum: -0.0000000
charge: 0.887304 -0.173603 -0.170535 -0.178942 -0.166500 -0.166271 -0.162049 -0.501832 -0.508820 -0.473196 -0.264094 -0.204028 -0.128402 -0.376945 -0.409974 -0.354932 -0.121266 -0.051296 -0.004240 -0.121920 0.547943 -0.163327 -0.105926 0.397354 0.426309 0.236955 0.472017 0.495518 -0.122128 0.152594 0.150184 0.242629 0.168264 0.169672 0.201837 0.140701 0.123777 0.117166
qa: 0.8873 -0.1736 -0.1705 -0.1789 -0.1665 -0.1663 -0.1620 -0.5018 -0.5088 -0.4732 -0.2641 -0.2040 -0.1284 -0.3769 -0.4100 -0.3549 -0.1213 -0.0513 -0.0042 -0.1219 0.5479 -0.1633 -0.1059 0.3974 0.4263 0.2370 0.4720 0.4955 -0.1221 0.1526 0.1502 0.2426 0.1683 0.1697 0.2018 0.1407 0.1238 0.1172
va: 5.8063 1.1310 1.1216 1.1223 1.1405 1.1401 1.1519 1.9974 1.9806 2.0428 2.1656 3.1106 3.2374 3.0029 2.9768 3.0160 3.8317 3.7614 3.8243 3.9514 4.4076 3.9642 3.8996 4.3826 4.2007 4.0736 4.2167 4.5258 3.8398 1.0190 1.0081 1.0177 0.9868 0.9854 1.0106 0.9951 0.9923 0.9980
dispcorr: -0.020636547 hartree
energy: -2073.033473236965
dipole: 24.13641 -22.54879 1.58762 -0.18686 -0.86479 -1.05165 -7.86039 9.15105 1.29066
magnitude: 2.30050 au
magnitude: 5.84740 debye
